program: Orca
programVersion: 5.0.3
elementType: C H C H C C C H H C H H C C H H H H H H H
charge: 1
multiplicity: 1
keywords: b3lyp cc-pVTZ EnGrad RIJCOSX verytightscf cc-pVTZ/C def2/J soscf
formula: C8H13
InChI: InChI=1/C8H13/c1-3-7-5-2-6-8(4-1)9-7/h3,6-8H,1-2,4-5H2
21 atoms
C  -2.003122 0.682406 0.09547
H  -2.209706 0.872328 1.15306
C  -1.809653 -0.923788 -0.135045
H  -2.63415 -1.425778 0.374224
C  -0.445184 -1.334739 0.404276
C  0.695117 -1.275653 -0.363027
C  2.00688 -0.678283 0.085183
H  2.216907 -0.879402 1.140112
H  2.853904 -1.01245 -0.516651
C  1.816875 0.920645 -0.134891
H  1.888956 1.142336 -1.204477
H  2.63373 1.431207 0.378312
C  0.44331 1.311829 0.408464
C  -0.703491 1.295445 -0.355866
H  0.535719 -1.219028 -1.443987
H  -1.884868 -1.134994 -1.206364
H  0.005537 0.007984 0.224678
H  -0.556289 1.27821 -1.439636
H  -2.857386 1.00836 -0.500376
H  0.342715 1.375763 1.495092
H  -0.344154 -1.423234 1.488739
totalener: -312.18334363 hartree
nucrepener: 382.76442415 hartree
electener: -694.94776778 hartree
oneelecener: -1166.06556305 hartree
twoeener: 471.11779528 hartree
kineticenergy: 309.94641008 hartree
exchangeener: -36.295540237307 hartree
correlationener: -2.309150167297 hartree
xcener: -38.604690404604 hartree
chargesum: 1.0000000
charge: -0.193024 0.145358 -0.204680 0.158147 -0.054250 -0.021404 -0.191870 0.143882 0.159082 -0.202946 0.141975 0.157598 -0.054214 -0.019012 0.154162 0.142872 0.099151 0.157018 0.159746 0.160767 0.161642
charge: 0.111143 -0.004008 0.117992 0.000074 0.121923 0.155949 0.109809 -0.004243 0.001160 0.118010 -0.005587 -0.000226 0.122673 0.163349 0.000888 -0.005509 -0.010797 0.000901 0.001420 0.003874 0.001206
qa: -0.1930 0.1454 -0.2047 0.1581 -0.0543 -0.0214 -0.1919 0.1439 0.1591 -0.2029 0.1420 0.1576 -0.0542 -0.0190 0.1542 0.1429 0.0992 0.1570 0.1597 0.1608 0.1616
va: 3.8429 0.9882 3.8637 0.9815 3.7631 3.7620 3.8432 0.9888 0.9805 3.8636 0.9893 0.9820 3.7648 3.7574 0.9933 0.9888 1.1034 0.9917 0.9805 0.9942 0.9931
energy: -312.183343629238
dipole: -0.00848 -0.01280 -0.02129 0.02045 0.00229 0.02275 -0.05341 0.03441 -0.01899
magnitude: 0.03649 au
magnitude: 0.09274 debye
