program: Orca
programVersion: 5.0.3
elementType: C H C H C C C H H C H H C C H H H H H H H
charge: 1
multiplicity: 1
keywords: DSD-PBEP86/2013 def2-TZVP RIJCOSX verytightscf def2-TZVP/C def2/J soscf noTRAH
formula: C8H13
InChI: InChI=1/C8H13/c1-2-4-6-8-7-5-3-1/h1-2,7H,3-6,8H2
21 atoms
C  -1.990021 0.563875 0.102712
H  -2.166221 0.74598 1.167816
C  -1.867913 -0.971682 -0.174687
H  -2.662075 -1.52519 0.333196
C  -0.464513 -1.264377 0.328862
C  0.636245 -1.208691 -0.462419
C  1.927516 -0.684158 0.072492
H  2.070436 -0.946591 1.126011
H  2.796115 -1.037823 -0.492235
C  1.841634 0.86967 -0.081631
H  1.901286 1.135466 -1.143724
H  2.687821 1.351672 0.416229
C  0.51158 1.453257 0.510696
C  -0.640955 1.074135 -0.309186
H  0.530066 -1.296692 -1.544413
H  -1.93998 -1.168518 -1.249219
H  0.373509 1.199908 1.565275
H  -0.521723 1.262389 -1.380629
H  -2.792392 1.023043 -0.48595
H  0.612584 2.553675 0.435589
H  -0.330623 -1.258749 1.412117
totalener: -311.16258705 hartree
nucrepener: 381.46619396 hartree
electener: -692.62878100 hartree
oneelecener: -1163.31458259 hartree
twoeener: 470.68580159 hartree
kineticenergy: 309.99733722 hartree
exchangeener: -12.757571398949 hartree
correlationener: -0.944624927656 hartree
xcener: -13.702196326605 hartree
chargesum: 1.0000000
charge: -0.206869 0.171950 -0.207454 0.177519 -0.138650 -0.136459 -0.221388 0.157096 0.169208 -0.241029 0.150952 0.174756 -0.184654 0.076592 0.174561 0.164233 0.162082 0.207484 0.182101 0.200035 0.167934
charge: -0.196802 0.158717 -0.194673 0.150476 -0.094047 -0.113035 -0.218352 0.151152 0.154449 -0.199676 0.145105 0.150410 -0.217251 0.176276 0.156409 0.152720 0.156832 0.174152 0.159921 0.190100 0.157117
qa: -0.2069 0.1719 -0.2075 0.1775 -0.1386 -0.1365 -0.2214 0.1571 0.1692 -0.2410 0.1510 0.1748 -0.1847 0.0766 0.1746 0.1642 0.1621 0.2075 0.1821 0.2000 0.1679
va: 3.8431 0.9689 3.8527 0.9696 3.8666 3.8582 3.8977 0.9715 0.9707 3.8680 0.9714 0.9634 3.8812 3.5510 0.9612 0.9736 0.9739 0.9414 0.9685 0.9581 0.9636
total: -311.843747787 hartree
energy: -311.843747787050
dipole: 0.52363 -0.99939 -0.47576 1.90836 -0.97254 0.93582 0.14980 -0.32342 -0.17362
magnitude: 1.06407 au
magnitude: 2.70466 debye
