program: Orca
programVersion: 5.0.3
elementType: C H C H C C C H H C H H C C H H H H H H H
charge: 1
multiplicity: 1
keywords: b3lyp def2-TZVP EnGrad D3BJ RIJCOSX verytightscf def2/J soscf
formula: C8H13
InChI: InChI=1/C8H13/c1-2-4-6-8-7-5-3-1/h1-2,7H,3-6,8H2
21 atoms
C  -1.990021 0.563875 0.102712
H  -2.166221 0.74598 1.167816
C  -1.867913 -0.971682 -0.174687
H  -2.662075 -1.52519 0.333196
C  -0.464513 -1.264377 0.328862
C  0.636245 -1.208691 -0.462419
C  1.927516 -0.684158 0.072492
H  2.070436 -0.946591 1.126011
H  2.796115 -1.037823 -0.492235
C  1.841634 0.86967 -0.081631
H  1.901286 1.135466 -1.143724
H  2.687821 1.351672 0.416229
C  0.51158 1.453257 0.510696
C  -0.640955 1.074135 -0.309186
H  0.530066 -1.296692 -1.544413
H  -1.93998 -1.168518 -1.249219
H  0.373509 1.199908 1.565275
H  -0.521723 1.262389 -1.380629
H  -2.792392 1.023043 -0.48595
H  0.612584 2.553675 0.435589
H  -0.330623 -1.258749 1.412117
totalener: -312.23773352 hartree
nucrepener: 381.46619396 hartree
electener: -693.70392747 hartree
oneelecener: -1163.96336715 hartree
twoeener: 470.25943968 hartree
kineticenergy: 310.52839149 hartree
exchangeener: -36.326526965878 hartree
correlationener: -2.304953658017 hartree
xcener: -38.631480623895 hartree
chargesum: 1.0000000
charge: -0.185341 0.158516 -0.193312 0.164805 -0.094058 -0.080879 -0.209785 0.148804 0.160710 -0.220152 0.144918 0.163118 -0.137815 0.017105 0.162179 0.151893 0.148227 0.190572 0.168583 0.186992 0.154921
charge: -0.200469 0.159793 -0.195753 0.152373 -0.076617 -0.101115 -0.215631 0.154106 0.160215 -0.198107 0.148744 0.153693 -0.217006 0.116955 0.158853 0.154805 0.157751 0.170716 0.162183 0.195433 0.159076
qa: -0.1853 0.1585 -0.1933 0.1648 -0.0941 -0.0809 -0.2098 0.1488 0.1607 -0.2202 0.1449 0.1631 -0.1378 0.0171 0.1622 0.1519 0.1482 0.1906 0.1686 0.1870 0.1549
va: 3.8408 0.9694 3.8322 0.9698 3.8281 3.8104 3.8890 0.9693 0.9700 3.8513 0.9685 0.9642 3.8454 3.6180 0.9640 0.9731 0.9756 0.9491 0.9686 0.9588 0.9663
dispcorr: -0.036705805 hartree
energy: -312.274439324509
dipole: 0.52363 -0.85514 -0.33152 1.90836 -1.16469 0.74367 0.14980 -0.27344 -0.12364
magnitude: 0.82355 au
magnitude: 2.09331 debye
