program: Orca
programVersion: 5.0.3
elementType: C H C H C C C H H C H H C C H H H H H H H
charge: 1
multiplicity: 1
keywords: DSD-PBEP86/2013 def2-TZVP D3BJ RIJCOSX verytightscf def2-TZVP/C def2/J soscf noTRAH
formula: C8H13
InChI: InChI=1/C8H13/c1-3-7-5-2-6-8(4-1)9-7/h3,6-8H,1-2,4-5H2
21 atoms
C  -1.999279 0.675532 0.100031
H  -2.199406 0.866803 1.158688
C  -1.819036 -0.928062 -0.133023
H  -2.639031 -1.431547 0.382011
C  -0.450508 -1.334674 0.399218
C  0.691425 -1.27334 -0.365137
C  2.002704 -0.673577 0.089319
H  2.206967 -0.875261 1.145278
H  2.851673 -1.011779 -0.507492
C  1.823125 0.926678 -0.132232
H  1.901957 1.148288 -1.201335
H  2.63864 1.433499 0.386794
C  0.449172 1.317821 0.404455
C  -0.697092 1.288716 -0.356591
H  0.538809 -1.233274 -1.44767
H  -1.899981 -1.139754 -1.203899
H  0.003682 0.000242 0.165283
H  -0.554727 1.281738 -1.440983
H  -2.854631 1.009944 -0.489672
H  0.34444 1.351536 1.491888
H  -0.344879 -1.394928 1.485326
totalener: -311.09578405 hartree
nucrepener: 382.82490050 hartree
electener: -693.92068456 hartree
oneelecener: -1165.56951818 hartree
twoeener: 471.64883362 hartree
kineticenergy: 309.95880669 hartree
exchangeener: -14.118721270802 hartree
correlationener: -0.949546232360 hartree
xcener: -15.068267503162 hartree
chargesum: 1.0000000
charge: -0.221632 0.165838 -0.248109 0.182482 -0.120767 -0.050504 -0.223975 0.165343 0.180081 -0.250863 0.167742 0.182098 -0.114276 -0.057437 0.164096 0.168101 0.205133 0.165420 0.180241 0.180727 0.180263
charge: -0.194015 0.151199 -0.192358 0.153942 -0.132415 -0.077726 -0.194491 0.150963 0.154249 -0.192731 0.150335 0.153668 -0.136056 -0.073476 0.163909 0.150537 0.320004 0.163621 0.154374 0.163530 0.162936
qa: -0.2216 0.1658 -0.2481 0.1825 -0.1208 -0.0505 -0.2240 0.1653 0.1801 -0.2509 0.1677 0.1821 -0.1143 -0.0574 0.1641 0.1681 0.2051 0.1654 0.1802 0.1807 0.1803
va: 3.8776 0.9707 3.9167 0.9672 3.8135 3.8618 3.8819 0.9706 0.9674 3.9209 0.9686 0.9676 3.7968 3.8777 0.9652 0.9687 0.9977 0.9642 0.9672 0.9632 0.9630
total: -311.761847396 hartree
dispcorr: -0.014316118 hartree
energy: -311.776163514382
dipole: -0.00604 -0.00572 -0.01176 0.00576 -0.00182 0.00394 -0.07067 0.03758 -0.03309
magnitude: 0.03534 au
magnitude: 0.08983 debye
