program: Orca
programVersion: 5.0.3
elementType: C H C H C C C H H C H H C C H H H H H H H
charge: 1
multiplicity: 1
keywords: b3lyp def2-TZVP EnGrad RIJCOSX verytightscf def2/J soscf
formula: C8H13
InChI: InChI=1/C8H13/c1-3-7-5-2-6-8(4-1)9-7/h3,6-8H,1-2,4-5H2
21 atoms
C  -2.004489 0.685971 0.093471
H  -2.213194 0.874599 1.150843
C  -1.804866 -0.922285 -0.135969
H  -2.631775 -1.422092 0.371575
C  -0.442721 -1.335355 0.406378
C  0.696532 -1.276785 -0.362389
C  2.00832 -0.680227 0.083333
H  2.220132 -0.880783 1.138033
H  2.854969 -1.012905 -0.51988
C  1.814257 0.917874 -0.136052
H  1.883617 1.139986 -1.205749
H  2.631446 1.430173 0.374879
C  0.440591 1.30871 0.41045
C  -0.706802 1.298786 -0.355983
H  0.53433 -1.213088 -1.442606
H  -1.87862 -1.133335 -1.207359
H  0.007073 0.015278 0.257548
H  -0.557545 1.276627 -1.439455
H  -2.858761 1.007545 -0.504643
H  0.342315 1.391779 1.496137
H  -0.344094 -1.437834 1.489718
totalener: -312.18602546 hartree
nucrepener: 382.71511924 hartree
electener: -694.90114470 hartree
oneelecener: -1166.01142549 hartree
twoeener: 471.11028079 hartree
kineticenergy: 310.49852372 hartree
exchangeener: -36.317041870773 hartree
correlationener: -2.308941212521 hartree
xcener: -38.625983083295 hartree
chargesum: 1.0000000
charge: -0.209317 0.156056 -0.246810 0.172536 -0.093727 -0.022354 -0.210654 0.154439 0.169630 -0.248764 0.160145 0.172005 -0.087357 -0.021132 0.148849 0.161243 0.175200 0.152431 0.170539 0.175168 0.171875
charge: -0.194744 0.153566 -0.191819 0.157143 -0.145071 -0.076395 -0.197130 0.153042 0.156693 -0.193089 0.152550 0.156534 -0.147486 -0.065232 0.163761 0.152799 0.313795 0.164245 0.157222 0.165925 0.163692
qa: -0.2093 0.1561 -0.2468 0.1725 -0.0937 -0.0224 -0.2107 0.1544 0.1696 -0.2488 0.1601 0.1720 -0.0874 -0.0211 0.1488 0.1612 0.1752 0.1524 0.1705 0.1752 0.1719
va: 3.8545 0.9691 3.9108 0.9675 3.7375 3.8254 3.8598 0.9692 0.9670 3.9141 0.9666 0.9682 3.7154 3.8386 0.9648 0.9664 0.9891 0.9634 0.9666 0.9611 0.9619
energy: -312.186025460582
dipole: -0.00945 -0.02220 -0.03164 0.03412 0.00911 0.04323 -0.03816 0.01865 -0.01951
magnitude: 0.05702 au
magnitude: 0.14493 debye
