program: Gaussian 09
title: 000050645
version: EM64L-G09RevD.01
frameworkgroup: C1[X(C14H19NO3)]
method: RPBEPBE
basis: SDD
operation: Freq
keyword: #p
keyword: freq=noraman
keyword: PBEPBE/SDD
title: #p freq=noraman PBEPBE/SDD
converged: YES YES NO NO
title: Mulliken charges:
elementType: O O O N C C C C C C C C C C C C C C H H H H H H H H H H H H H H H H H H H
charge: -0.295850 -0.241667 -0.260410 -0.140440 -0.022032 -0.073001 -0.347290 -0.342295 -0.363083 -0.802591 -0.323519 -0.324859 0.239923 0.247755 -0.375353 -0.379672 -0.228352 -0.225960 0.216165 0.248296 0.200138 0.208334 0.227715 0.195423 0.252729 0.231596 0.262818 0.217257 0.230659 0.192339 0.217031 0.216102 0.189917 0.247632 0.248568 0.227851 0.228125
chargesum: 0.00000
title: Mulliken charges with hydrogens summed into heavy atoms:
elementType: O O O N C C C C C C C C C C C C C C
charge: -0.295850 -0.241667 -0.260410 -0.140440 0.194133 0.175295 0.061182 0.080844 0.121242 -0.091858 0.085851 0.081160 0.239923 0.247755 -0.127721 -0.131104 -0.000500 0.002165
polarizability: 2.25034957e+02 5.04135293e+00 1.42276186e+02 1.34627144e+01 -1.12330862e+01 1.25415316e+02
1716.lowfreq: -11.6758 -0.0004 0.0006 0.0008 5.1519 10.7936 28.2204 38.7674 44.8689
frequency: 27.2056 38.5736 44.8426 104.6419 138.5118 148.5382 175.4311 205.6893 229.8945 261.4659 289.7798 295.8491 311.5138 323.0804 370.0162 392.6860 404.5542 451.3790 458.3382 465.3583 475.1952 507.7393 548.9541 562.9625 572.6516 603.6526 650.4834 711.4685 718.2495 747.8822 754.4825 808.4044 823.3697 843.8031 847.8524 859.9068 899.2273 908.8807 932.0566 950.7801 964.3532 965.6336 1000.2550 1025.6053 1026.7886 1043.3595 1051.3525 1053.3058 1079.2783 1088.3357 1100.3953 1108.8111 1134.9882 1149.0727 1160.7894 1164.1449 1185.1314 1197.6222 1221.0462 1237.3796 1251.7948 1265.0004 1268.6028 1285.0916 1296.4826 1301.8078 1331.6493 1336.0103 1341.6208 1350.6380 1372.5110 1375.2599 1379.5942 1390.4897 1392.8786 1442.7260 1443.1646 1448.7731 1451.4959 1461.1892 1463.7897 1475.0493 1487.7458 1490.4980 1589.9121 1612.1488 2867.9514 2871.3309 2881.9436 2951.8137 2956.8077 2991.3974 2994.6195 3011.5888 3044.8392 3063.8397 3079.6593 3082.9335 3087.7402 3100.0799 3121.0375 3136.3063 3149.2953 3161.4827 3174.1869
redmass: 3.7074 3.9975 5.3125 3.8720 3.8289 3.5483 4.0514 4.7327 2.4409 2.5528 3.3084 4.0127 2.3952 1.1560 4.1983 3.5874 1.9043 3.1736 5.3687 2.8957 4.2989 5.6707 4.0895 5.1826 2.5428 2.4120 3.4212 4.3638 4.7778 3.3303 1.2379 4.1795 4.9899 1.6144 1.4061 3.6281 2.6872 2.2813 1.3669 2.7427 3.1058 1.3031 2.4080 2.1829 1.9577 1.9758 2.2250 1.9937 3.9305 2.3930 2.4181 2.7150 2.4703 2.2740 1.1096 2.2854 1.4402 1.2917 1.4727 2.5892 1.3250 1.4344 1.3159 1.3476 1.3057 1.2078 1.3016 1.3147 1.2892 1.3650 1.5881 1.3599 1.4501 2.5334 1.4810 2.1936 1.1145 1.0799 1.0966 1.2193 1.1068 2.3919 1.0573 1.0515 7.4880 7.0600 1.0777 1.0736 1.0713 1.0667 1.0667 1.0542 1.0633 1.0670 1.0885 1.0893 1.0957 1.0975 1.0989 1.0990 1.1005 1.0851 1.0897 1.0947 1.1007
irintensity: 0.0763 0.1779 0.4376 2.9944 4.0018 3.9607 0.6411 1.2744 2.3581 2.4719 5.9452 4.2113 7.9558 0.1825 6.6648 1.2468 0.5633 5.1214 2.0840 1.1437 1.8573 0.4425 0.2732 1.5569 10.0157 2.6867 2.6326 0.6514 18.9873 10.8975 105.5635 19.9553 15.3577 0.2622 0.0635 5.9027 43.4612 28.5417 5.0600 13.4738 19.4241 0.3825 38.1322 10.0124 31.7871 23.1158 25.2781 16.1859 33.0948 34.1958 11.7956 10.3521 39.4672 30.2672 2.7607 25.1639 3.5151 2.8995 23.4115 260.5268 26.9922 2.2038 3.4102 45.2110 10.1838 6.6657 0.7542 4.4365 5.8790 4.5414 14.4633 11.9921 4.8536 13.4641 27.2707 5.2447 2.1913 4.7718 16.1043 29.4024 10.4715 174.5059 3.6754 10.1798 26.4222 3.7167 40.1098 27.6179 141.4495 35.8252 96.1813 19.2378 17.8977 49.1276 45.5856 27.9527 42.2839 33.2149 29.6470 20.9572 11.1628 1.0870 12.4297 15.6206 16.6259
temp: 298.150 k
press: 1.00000 atm
elementType: 8 8 8 7 6 6 6 6 6 6 6 6 6 6 6 6 6 6 1 1 1 1 1 1 1 1 1 1 1 1 1 1 1 1 1 1 1
symmnumber: 1
zpe: 812610.0 jmol-1
zpe.correction: 0.309507 hartree
zpe.thermalcorrener: 0.325470 hartree
zpe.thermalcorrenthalpy: 0.326414 hartree
zpe.thermalcorrgfe: 0.265559 hartree
zpe.sumelectzpe: -823.887296 hartree
zpe.sumelectthermal: -823.871333 hartree
zpe.sumelectthermalent: -823.870389 hartree
zpe.sumelectthermalfe: -823.931244 hartree
dipole: 0.4056 1.2611 0.3999
dipole: 1.3838
quadrupole: -115.5093 -106.5903 -105.4903
quadrupole: 4.7915 5.9295 1.3067
quadrupole: -6.3127 2.6064 3.7063 4.7915 5.9295 1.3067
hfenergy: -824.1968028 hartree
pointgroup: C01 [X(C14H19N1O3)]
dipole: -0.1613559 0.4993994 -0.1447776 debye
polarizability: 225.3245004|-5.1759105|141.7793933|12.2343664|11.6497952|125.622565 unknown
InChI: InChI=1S/C14H19NO3/c1-11(15-6-8-16-9-7-15)14-10-17-12-4-2-3-5-13(12)18-14/h2-5,11,14H,6-10H2,1H3
charge 0 multiplicity 1
37 atoms
O  1.173987 1.039394 0.493041
O  -5.096052 -0.904716 0.507786
O  1.491398 -1.308755 -1.221839
N  -2.443124 0.212174 0.000149
C  -1.234339 1.086652 0.155279
C  0.027248 0.189604 0.074697
C  -2.751808 -0.550124 1.245323
C  -3.681234 0.902585 -0.454779
C  0.3183 -0.407607 -1.307259
C  -1.163527 2.234909 -0.871534
C  -3.873393 -1.568555 0.984286
C  -4.788741 -0.134576 -0.707263
C  2.432769 0.426718 0.283567
C  2.58328 -0.726935 -0.536951
C  3.556796 0.989481 0.921544
C  3.851654 -1.32483 -0.683148
C  4.828112 0.396867 0.761344
C  4.973444 -0.767322 -0.032443
H  -1.216613 1.550209 1.173375
H  -0.04435 -0.646293 0.798669
H  -3.067622 0.141201 2.066231
H  -1.854122 -1.093182 1.591037
H  -3.486919 1.441258 -1.397356
H  -4.044095 1.643876 0.300652
H  -0.52129 -1.031707 -1.646315
H  0.534173 0.386288 -2.04693
H  -0.175632 2.718789 -0.788749
H  -1.290644 1.875899 -1.908783
H  -1.931822 3.001488 -0.674743
H  -3.531481 -2.312396 0.232217
H  -4.16139 -2.086713 1.91391
H  -5.733275 0.358603 -0.990926
H  -4.467765 -0.82461 -1.517866
H  3.41331 1.879507 1.542623
H  3.938013 -2.214118 -1.315569
H  5.697719 0.83777 1.259523
H  5.956235 -1.235135 -0.1513
