program: Orca
programVersion: 5.0.3
elementType: C H C H C C C H H C H H C C H H H H H H H
charge: 1
multiplicity: 1
keywords: DSD-PBEP86/2013 cc-pVTZ EnGrad D3BJ RIJCOSX verytightscf cc-pVTZ/C def2/J soscf
formula: C8H13
InChI: InChI=1/C8H13/c1-2-4-6-8-7-5-3-1/h1-2,7H,3-6,8H2
21 atoms
C  -2.000738 0.730318 0.078921
H  -2.199462 0.869744 1.145226
C  -1.75565 -0.933399 -0.145394
H  -2.618636 -1.353864 0.375991
C  -0.428354 -1.361938 0.406821
C  0.696382 -1.284647 -0.365152
C  2.008077 -0.687227 0.069193
H  2.221267 -0.878634 1.126457
H  2.859091 -1.023406 -0.527376
C  1.800251 0.894048 -0.144611
H  1.858702 1.132068 -1.211881
H  2.613203 1.424268 0.355752
C  0.423937 1.265748 0.444152
C  -0.748253 1.319449 -0.373556
H  0.530491 -1.21103 -1.444513
H  -1.848183 -1.125879 -1.216163
H  0.091483 0.238387 0.833051
H  -0.613855 1.369678 -1.458239
H  -2.870311 0.989498 -0.525767
H  0.375466 1.775262 1.416772
H  -0.347237 -1.517468 1.484676
totalener: -311.08782206 hartree
nucrepener: 381.04862763 hartree
electener: -692.13644969 hartree
oneelecener: -1162.31159190 hartree
twoeener: 470.17514221 hartree
kineticenergy: 309.68535047 hartree
exchangeener: -14.114025972396 hartree
correlationener: -0.945797277270 hartree
xcener: -15.059823249666 hartree
chargesum: 1.0000000
charge: -0.249137 0.185786 -0.268153 0.195099 -0.132254 -0.096099 -0.241197 0.161756 0.178682 -0.267310 0.165010 0.181885 -0.190532 0.063584 0.171400 0.182214 0.136140 0.206822 0.198141 0.223305 0.194859
charge: 0.118821 0.006024 0.138790 0.006882 0.040747 0.107476 0.085959 -0.004422 -0.002453 0.111959 -0.010068 -0.001747 0.093821 0.272383 -0.012112 -0.003519 0.009838 0.011054 0.006957 0.033622 -0.010011
qa: -0.2491 0.1858 -0.2682 0.1951 -0.1323 -0.0961 -0.2412 0.1618 0.1787 -0.2673 0.1650 0.1819 -0.1905 0.0636 0.1714 0.1822 0.1361 0.2068 0.1981 0.2233 0.1949
va: 3.8819 0.9768 3.9351 0.9689 3.8186 3.8355 3.8965 0.9851 0.9744 3.9136 0.9838 0.9769 3.8296 3.6523 0.9805 0.9766 1.0659 0.9689 0.9706 0.9700 0.9789
dispcorr: -0.014417873 hartree
energy: -311.784404937751
dipole: 0.04878 -0.61979 -0.57101 0.64586 0.04849 0.69434 0.33199 -0.36629 -0.03430
magnitude: 0.89963 au
magnitude: 2.28669 debye
