program: Orca
programVersion: 5.0.3
charge: 1
multiplicity: 1
keywords: DLPNO-CCSD(T1) tightPNO Extrapolate(3/4,def2) RIJK def2/JK verytightSCF miniprint nopop
formula: C8H13
InChI: InChI=1/C8H12.H/c1-2-4-6-8-7-5-3-1;/h1-2,7-8H,3-6H2;
21 atoms
C  -1.978812 0.655455 0.1202
H  -2.139582 0.846892 1.185772
C  -1.846881 -0.946412 -0.121768
H  -2.652001 -1.441227 0.424354
C  -0.467594 -1.345097 0.376898
C  0.675242 -1.260629 -0.381554
C  1.979433 -0.656631 0.108341
H  2.14368 -0.857723 1.171598
H  2.84522 -1.011513 -0.453649
C  1.846877 0.947372 -0.119002
H  1.960865 1.170451 -1.184473
H  2.653147 1.437791 0.429361
C  0.468652 1.34063 0.387071
C  -0.676813 1.265274 -0.36839
H  0.548499 -1.264396 -1.467468
H  -1.964058 -1.159892 -1.188882
H  0.000154 0.001452 0.015283
H  -0.554102 1.282183 -1.454733
H  -2.846643 1.015158 -0.435553
H  0.350204 1.324599 1.47466
H  -0.346591 -1.344429 1.463048
e0: -310.241224204 hartree
corrType: DLPNO BASED
e0: -310.254802802 hartree
basis: def2-TZVPP def2-QZVPP
scfener: -310.241224204 -310.254802801
corrmethod: MDCI MDCI
correner: -1.473688836 -1.544053320
corrcbsextra: -1.596175120
energy: -311.852848220081
dipole: -0.00114 -0.00038 -0.00152 -0.00049 0.00439 0.00390 -0.01948 0.01217 -0.00732
magnitude: 0.00843 au
magnitude: 0.02142 debye
