program: Gaussian 16
title: Sandwich 1
version: ES64L-G16RevC.02
basis: CC-pVTZ
frameworkgroup: C1[X(C8H13)]
method: RDSDPBEP86-FC
operation: Freq
keyword: #
keyword: p
keyword: freq
keyword: cc-pvtz
keyword: dsdpbep86
keyword: iop(3/125=0250005300,3/78=0430004300,3/76=0300007000,3/74=1004)
keyword: empiricaldispersion=gd3bj
keyword: iop(3/174=0418000,3/175=-1,3/176=0,3/177=-1,3/178=5650000)
title: # p freq cc-pvtz dsdpbep86 iop(3/125=0250005300,3/78=0430004300,3/76=0
nucrepener: 390.6914180039
converged: YES YES YES YES
title: Mulliken charges:
elementType: C H C H C C C H H C H H C C H H H H H H H
charge: -0.184319 0.157368 -0.217323 0.175323 -0.028313 -0.030012 -0.225901 0.152079 0.170784 -0.224206 0.146929 0.166278 -0.210904 -0.095096 0.219049 0.158175 0.144569 0.182602 0.170480 0.174668 0.197770
chargesum: 1.00000
title: Mulliken charges with hydrogens summed into heavy atoms:
elementType: C C C C C C C C
charge: 0.143529 0.116176 0.169456 0.189037 0.096962 0.089001 0.108332 0.087506
1716.lowfreq: -5.4273 -4.6464 -0.0004 0.0004 0.0008 4.3633 148.8978 220.2191 258.6943
frequency: 148.8977 220.2189 258.6943 315.6448 372.1398 438.3659 452.5726 510.7186 567.7936 589.5258 807.1916 853.0541 872.3338 889.7862 924.8380 940.9353 970.5183 980.6313 1003.5104 1019.8852 1059.9141 1082.4823 1116.3104 1121.1372 1168.4919 1185.7142 1195.2112 1215.0738 1248.6750 1265.8020 1283.7438 1299.5356 1310.8404 1319.7552 1334.8013 1357.3730 1372.1960 1386.4973 1486.6916 1501.0563 1502.8520 1514.3976 1514.9500 1603.8133 3069.6637 3081.0045 3089.2062 3103.1049 3107.0709 3114.7395 3125.0144 3149.7099 3157.5968 3170.3662 3173.1672 3193.0298 3197.3970
redmass: 2.1117 2.3909 4.1903 1.8603 2.5999 4.4411 2.3832 3.1217 2.5553 2.0176 1.4211 1.5384 2.2789 1.6308 2.0499 1.7277 2.2268 1.5443 1.5972 1.6792 1.7361 1.2906 1.6248 1.5995 1.7164 1.5733 1.3005 1.3590 1.3342 1.3786 1.3349 1.3961 1.3001 1.2959 1.2899 1.2226 1.4321 1.4897 1.0940 1.0851 1.0924 1.1204 1.1108 4.3014 1.0603 1.0676 1.0616 1.0629 1.0820 1.0627 1.1003 1.1009 1.1049 1.0912 1.1108 1.0956 1.1040
irintensity: 0.3707 4.2350 19.8086 1.2342 0.2835 10.2052 4.3899 6.1691 1.4951 0.7214 6.4672 0.3324 4.8127 4.9565 5.2009 7.4406 2.3088 7.9375 3.4229 3.7694 2.4730 13.3331 4.3674 2.5980 3.0847 4.5966 0.8143 7.9899 3.9955 3.1037 5.7183 10.6498 3.4223 1.2631 11.0950 1.6301 0.4728 0.8722 9.5971 9.0231 10.3896 4.1403 1.7404 3.1348 2.7597 4.7913 4.3491 2.7997 1.8466 1.8835 2.3672 1.7101 2.5546 0.8645 0.6921 2.0688 0.0751
temp: 298.150 k
press: 1.00000 atm
elementType: 6 1 6 1 6 6 6 1 1 6 1 1 6 6 1 1 1 1 1 1 1
symmnumber: 1
zpe: 510300.9 jmol-1
zpe.correction: 0.194363 hartree
zpe.thermalcorrener: 0.201488 hartree
zpe.thermalcorrenthalpy: 0.202432 hartree
zpe.thermalcorrgfe: 0.163571 hartree
zpe.sumelectzpe: -311.659521 hartree
zpe.sumelectthermal: -311.652396 hartree
zpe.sumelectthermalent: -311.651452 hartree
zpe.sumelectthermalfe: -311.690314 hartree
dipole: -0.6332 -0.4836 -0.3914
dipole: 0.8877
quadrupole: -34.7842 -41.4477 -42.3803
quadrupole: -0.4138 -0.2871 0.3701
quadrupole: 4.7532 -1.9104 -2.8429 -0.4138 -0.2871 0.3701
hfenergy: -311.1604426 hartree
pointgroup: C01 [X(C8H13)]
dipole: -0.2414119 -0.154791 -0.1403784 debye
dipolederiv: -0.0188411 -0.0740098 0.070138 0.0046992 0.0007581 -0.0434623 -0.151875 0.0703975 0.1374726 0.0461344 0.0023886 -0.0340907 0.0077591 0.0293542 -0.0143728 0.0018433 -0.0428194 -0.0186034 0.0791927 0.050682 -0.0494571 0.1839667 -0.0333763 -0.0083095 -0.0165469 0.0458457 0.1090922 0.0235441 -0.0219949 0.0204774 -0.0400108 0.0828899 0.0068933 0.0381409 0.0245897 0.0468651 0.350769 0.0173104 -0.0974125 0.1337167 -0.1716237 -0.0123747 -0.0852561 -0.0689186 0.1224152 0.3898981 -0.1534618 0.0250692 -0.3095416 -0.0017822 0.100484 0.0717338 0.2011638 0.119572 -0.1128292 -0.0730058 -0.0205459 -0.1701237 -0.0263948 -0.0040447 0.0261147 -0.0450367 0.077302 0.0213096 -0.0092969 0.0436892 -0.0013617 0.0589821 -0.0003686 0.0049441 0.0296688 -0.0405716 0.0418855 0.0339971 0.0113903 0.0443248 0.0379461 -0.0227722 -0.0045947 -0.0354911 0.0608387 0.0470376 0.0257163 0.0042545 0.0994128 0.1651687 0.010036 -0.1414915 -0.0389941 0.1194666 0.0631518 0.0136409 -0.0083237 0.0052727 0.0122143 0.0068661 0.0425568 0.0191145 -0.0739297 -0.0254626 -0.0185032 -0.030305 -0.0446719 0.0581275 -0.0084666 -0.0472441 -0.0153627 0.0508104 -0.0978884 -0.0111057 -0.0102219 -0.011781 -0.1760379 -0.0293945 0.0380752 0.0833478 0.0856857 -0.087501 0.1853237 0.0738744 0.0932051 0.5748392 0.0204148 0.2985442 -0.1151338 0.0335176 0.036055 0.0063626 -0.0396137 0.0212978 0.1143865 -0.0027534 -0.0395094 -0.0043343 0.0538126 0.0563244 0.0099655 0.0318676 -0.0105153 0.0471318 -0.0304904 -0.0160405 -0.0422612 -0.0172875 0.0089379 0.0035199 0.0461394 0.0074683 0.0787585 0.0278423 0.0225376 -0.0225191 -0.0513069 0.0562416 -0.0152243 0.0138299 -0.0842161 0.005693 -0.0042961 0.0053196 -0.031145 0.0228237 0.0038007 0.0530027 -0.0096303 0.0715104 0.0233587 0.0164108 0.0099753 0.0150477 0.0325489 0.080757 -0.0252651 -0.0006323 0.0068826 0.0131132 0.0247241 -0.0258499 0.0023455 0.0745641 0.037483 -0.0000422 -0.0404968 -0.0072941 0.1064932 -0.0325656 -0.0313773 -0.029505 0.0549116 unknown
polarizability: 94.5515557|-2.220422|81.1898896|-1.284418|0.3898853|67.8443978 unknown
InChI: InChI=1/8C.13H
charge 1 multiplicity 1
21 atoms
C  -1.813911 0.926749 -0.047685
H  -1.917584 1.396836 0.929142
C  -2.18458 -0.571266 0.020277
H  -2.958908 -0.840215 0.731662
C  -0.778479 -0.879262 0.464878
C  0.290718 -1.208149 -0.346186
C  1.691165 -1.021438 0.144847
H  1.735001 -1.233072 1.214505
H  2.373524 -1.695769 -0.369891
C  2.083243 0.459705 -0.108984
H  2.320288 0.596057 -1.166356
H  2.97261 0.717878 0.463664
C  0.882218 1.331957 0.260763
C  -0.318649 0.697504 -0.377277
H  0.109411 -1.563638 -1.355348
H  -2.408812 -0.987589 -0.960844
H  0.751431 1.417858 1.341197
H  -0.200146 0.597114 -1.457591
H  -2.323912 1.519628 -0.803902
H  0.997012 2.342542 -0.141556
H  -0.560271 -0.682427 1.511516
