program: Gaussian 09
title: 000050711
version: EM64L-G09RevD.01
frameworkgroup: C1[X(C17H28N2O2)]
method: RPBEPBE
basis: SDD
operation: Freq
keyword: #p
keyword: freq=noraman
keyword: PBEPBE/SDD
title: #p freq=noraman PBEPBE/SDD
converged: YES YES NO NO
title: Mulliken charges:
elementType: O O N N C C C C C C C C C C C C C C C C C H H H H H H H H H H H H H H H H H H H H H H H H H H H H
charge: -0.308443 -0.282023 -0.379550 -0.685184 0.000480 -0.414400 -0.451031 -0.446475 -0.370689 -0.356314 0.078810 -0.705248 -0.695038 -0.725464 0.182602 0.218876 -0.336715 -0.330157 -0.407407 -0.401091 0.499759 0.186081 0.245460 0.186108 0.187930 0.220906 0.258111 0.208985 0.244558 0.214862 0.204937 0.180514 0.199175 0.241338 0.205029 0.207278 0.223430 0.210727 0.212214 0.215541 0.227184 0.234179 0.209277 0.265301 0.266065 0.220377 0.218787 0.309983 0.310367
chargesum: 0.00000
title: Mulliken charges with hydrogens summed into heavy atoms:
elementType: O O N N C C C C C C C C C C C C C C C C C
charge: -0.308443 -0.282023 -0.121439 -0.064835 0.186561 0.017168 -0.042195 0.007067 0.049111 0.023374 0.320149 -0.069510 -0.056556 -0.054824 0.182602 0.218876 -0.071414 -0.064091 -0.187031 -0.182305 0.499759
polarizability: 3.19228447e+02 -8.68199124e+00 1.80900563e+02 -1.53477227e+01 -2.05415655e+01 1.63713962e+02
1716.lowfreq: -17.8708 -4.5654 -0.0001 0.0008 0.0010 3.9358 9.6429 22.4594 26.7528
frequency: -7.3666 22.4286 26.6568 41.4582 49.2878 56.7776 72.4553 85.2407 95.3606 103.6366 108.9335 117.9481 151.2940 197.5595 211.0853 228.5037 236.4671 238.1950 248.2867 256.6657 259.2950 286.6117 298.4113 321.6146 362.0233 373.4956 384.1281 408.6807 410.3068 416.3028 419.7925 425.8817 479.9717 504.1827 507.9958 576.6067 611.9363 634.2400 651.3038 677.3442 730.5536 746.9928 754.8906 773.8370 787.9721 813.7927 824.0124 831.4813 842.9757 849.8501 854.8889 889.8967 902.6826 903.7889 940.0443 973.4875 983.3207 996.8602 1001.9423 1017.3624 1023.5421 1040.0125 1051.9378 1057.3711 1061.1216 1073.4690 1102.2135 1113.3582 1129.0907 1131.8424 1151.7728 1173.2597 1177.8168 1187.4036 1228.5066 1236.8581 1250.8357 1256.1943 1266.8101 1283.2181 1288.9362 1297.8181 1302.3397 1307.6344 1321.8915 1324.7760 1338.4910 1346.1880 1351.4549 1364.4735 1373.8417 1383.3204 1389.6053 1391.4272 1392.2267 1445.4170 1446.9303 1455.7529 1459.6893 1469.5835 1470.5833 1473.7025 1475.8054 1476.4109 1477.5653 1479.9038 1486.1178 1492.8637 1515.5674 1568.3146 1600.4782 1631.2814 1646.0879 2827.5255 2955.8293 2956.1605 2963.5218 2967.1247 2971.6231 2973.2725 2976.4576 2986.9702 3000.3075 3008.1964 3017.5870 3030.7865 3039.0774 3049.7111 3062.9304 3066.7406 3069.5762 3072.2385 3088.2470 3097.7317 3123.0703 3125.9341 3158.8910 3173.6972 3507.1955 3561.5214 3701.4355
redmass: 3.8633 4.9655 4.1383 3.5475 3.5982 1.7234 3.3283 3.2170 3.5186 3.1386 3.4339 4.0528 2.0527 2.2965 1.2267 2.8313 1.1713 2.0114 1.7522 2.2601 3.3071 4.2287 3.2100 3.5560 4.3414 2.9991 2.1080 1.2008 1.1776 2.2557 2.2786 3.2979 1.7546 3.3391 2.7986 3.1553 5.6156 6.8958 3.1853 4.0178 1.1801 1.1216 4.5088 4.7199 2.3583 3.5168 1.2681 5.0833 1.8527 1.5366 1.3775 1.6970 1.7608 1.9004 1.5765 1.3614 1.3500 3.3046 2.1375 1.4832 1.8124 2.3618 2.0352 3.2402 2.0903 1.9449 2.0814 2.0797 1.2139 2.4909 2.2222 2.3138 1.2955 1.9616 1.4006 1.2784 2.3135 1.2584 1.2809 1.1462 1.1478 1.3212 1.3520 1.3055 1.4335 3.0210 1.3376 1.4172 1.4938 1.2950 1.4279 1.3189 1.2277 1.2141 4.8587 1.2024 4.1250 1.0939 1.1062 1.0555 1.0699 1.0549 1.0601 1.0556 1.0429 1.0578 1.0708 1.0861 3.2284 7.4984 9.5926 3.4280 1.4001 1.0810 1.0577 1.0596 1.0556 1.0408 1.0596 1.0379 1.0595 1.0358 1.0984 1.0971 1.1019 1.1021 1.1025 1.0886 1.0998 1.1004 1.1005 1.0995 1.0985 1.0997 1.0893 1.0894 1.0952 1.0947 1.0751 1.0450 1.1040
irintensity: 0.1959 1.7713 0.4629 0.3673 1.2161 0.0479 0.3542 0.4281 0.4778 1.8120 0.3228 0.8707 0.7762 1.0085 2.2940 0.7804 0.1446 0.6920 0.4548 6.7699 6.3973 6.0885 0.2621 3.5076 5.5458 5.1204 8.1084 229.8510 81.8843 0.7233 7.2311 11.6721 49.4266 5.4071 1.0354 7.1390 7.3403 1.7659 11.3937 26.6467 7.7484 10.1164 12.9915 8.0921 12.6248 10.0366 0.4228 9.9253 69.6638 1.7678 2.0846 5.1194 8.1876 5.3989 6.7530 0.1494 0.1217 40.9897 3.4619 15.6879 0.8907 300.3206 1.4930 149.2895 0.1462 7.3585 43.7189 11.7383 15.8977 21.3934 8.3372 101.4674 149.7096 3.3430 2.9570 1.0030 290.7357 1.8970 8.1192 3.2582 0.9946 4.3574 29.4889 1.4853 2.7760 125.9827 50.9941 3.1287 1.3336 8.6708 2.0365 23.6130 10.0985 10.9340 12.4902 15.6034 8.9061 0.2944 13.3086 6.2403 10.1599 18.6844 4.8507 0.2637 13.3503 3.3401 12.8709 15.4087 89.3389 64.5513 332.3158 125.8277 336.8272 88.3025 38.8679 35.6998 23.0300 46.5161 25.8660 26.2804 64.2321 22.6069 6.2870 1.6736 22.5276 28.5877 41.4997 8.2877 65.0679 78.7202 78.8103 51.4524 37.3374 23.1844 15.6878 25.3070 9.0424 4.0078 1.3420 116.4716 22.8154
temp: 298.150 k
press: 1.00000 atm
elementType: 8 8 7 7 6 6 6 6 6 6 6 6 6 6 6 6 6 6 6 6 6 1 1 1 1 1 1 1 1 1 1 1 1 1 1 1 1 1 1 1 1 1 1 1 1 1 1 1 1
symmnumber: 1
zpe: 1111064.5 jmol-1
zpe.correction: 0.423182 hartree
zpe.thermalcorrener: 0.446524 hartree
zpe.thermalcorrenthalpy: 0.447468 hartree
zpe.thermalcorrgfe: 0.369180 hartree
zpe.sumelectzpe: -922.930016 hartree
zpe.sumelectthermal: -922.906675 hartree
zpe.sumelectthermalent: -922.905730 hartree
zpe.sumelectthermalfe: -922.984018 hartree
dipole: 3.5857 -2.6540 -0.5089
dipole: 4.4899
quadrupole: -77.5381 -128.1606 -128.1076
quadrupole: -2.3149 -5.0475 -4.0504
quadrupole: 33.7307 -16.8919 -16.8388 -2.3149 -5.0475 -4.0504
hfenergy: -923.3531982 hartree
pointgroup: C01 [X(C17H28N2O2)]
dipole: -1.460241 0.9351835 -0.336984 debye
polarizability: 319.2453091|0.2851733|185.1345696|16.896318|18.8130186|159.4630931 unknown
InChI: InChI=1S/C17H28N2O2/c1-4-6-16(7-5-2)19-12-13(3)21-17(20)14-8-10-15(18)11-9-14/h8-11,13,16,19H,4-7,12,18H2,1-3H3
charge 0 multiplicity 1
49 atoms
O  -0.869385 0.626735 0.82109
O  -0.657239 -1.340654 -0.428823
N  2.821172 1.095163 0.075655
N  -6.994325 0.033165 -1.003363
C  3.528517 0.162488 -0.841575
C  3.139996 -1.314035 -0.553222
C  5.055988 0.398828 -0.738084
C  1.360549 1.226193 -0.073595
C  3.574262 -1.846782 0.831005
C  5.542068 1.742595 -1.331904
C  0.602678 0.581682 1.117368
C  2.960357 -3.229743 1.140653
C  7.079387 1.885797 -1.288012
C  0.798544 1.324163 2.43626
C  -1.378708 -0.404879 0.016854
C  -2.831474 -0.259747 -0.225182
C  -3.489972 -1.233102 -1.025431
C  -3.593498 0.814618 0.310072
C  -4.864139 -1.142487 -1.286433
C  -4.969413 0.915318 0.055707
C  -5.630383 -0.063114 -0.748629
H  3.230119 0.366931 -1.903835
H  2.041267 -1.424845 -0.653917
H  3.585284 -1.9447 -1.351117
H  5.567659 -0.427357 -1.271825
H  5.361949 0.33051 0.324631
H  3.299368 1.99611 0.160725
H  1.063487 2.293351 -0.129201
H  1.016964 0.739254 -1.008974
H  3.268748 -1.113745 1.60318
H  4.67929 -1.914233 0.883438
H  5.089604 2.596128 -0.78503
H  5.188778 1.824915 -2.380188
H  0.898754 -0.47894 1.198949
H  3.267877 -3.980261 0.38718
H  3.273549 -3.601238 2.134377
H  1.854876 -3.180931 1.125166
H  7.566998 1.076496 -1.863644
H  7.452425 1.827041 -0.248122
H  7.410555 2.850988 -1.713378
H  0.279432 0.811741 3.264187
H  1.878765 1.362452 2.661968
H  0.411691 2.357483 2.36683
H  -2.896009 -2.057779 -1.433692
H  -3.088927 1.563803 0.926634
H  -5.357854 -1.90141 -1.905449
H  -5.545635 1.748865 0.475663
H  -7.543918 0.797754 -0.621676
H  -7.468581 -0.661485 -1.573388
