program: Gaussian 16
title: Sandwich 1
version: ES64L-G16RevC.01
frameworkgroup: C1[X(C8H13)]
method: RB3LYP
basis: 6-31G(d)
operation: Freq
keyword: #N
keyword: Geom=AllCheck
keyword: Guess=TCheck
keyword: SCRF=Check
keyword: GenChk
keyword: RB3LYP/6-31G(d)
keyword: Freq
converged: YES YES YES YES
title: Mulliken charges:
elementType: C H C H C C C H H C H H C C H H H H H H H
charge: -0.295671 0.209065 -0.303337 0.221697 -0.074164 -0.061498 -0.327845 0.204407 0.218053 -0.290308 0.188128 0.210863 -0.286973 -0.143524 0.233553 0.205222 0.188786 0.229990 0.221149 0.223433 0.228974
chargesum: 1.00000
title: Mulliken charges with hydrogens summed into heavy atoms:
elementType: C C C C C C C C
charge: 0.134542 0.123582 0.154810 0.172054 0.094616 0.108683 0.125246 0.086466
1716.lowfreq: -10.2089 -7.2782 -0.0006 -0.0006 0.0004 7.7334 148.9066 214.5426 246.2110
frequency: 148.9049 214.5416 246.2109 310.4811 371.8927 396.7248 452.9011 502.2741 554.0522 592.3763 809.4012 848.3884 855.0634 889.4845 914.6479 936.5666 957.8559 973.3706 1001.0539 1014.8434 1049.0077 1081.3091 1110.2287 1121.5397 1162.7626 1179.0309 1196.2322 1215.6689 1248.4076 1263.9813 1291.2125 1306.6279 1323.0118 1325.4405 1343.0535 1367.1517 1381.4124 1400.0444 1501.4379 1516.0972 1519.4971 1529.2137 1531.2877 1605.7640 3060.3274 3079.6504 3084.6782 3098.6424 3106.4840 3109.7872 3122.1199 3142.2792 3148.8170 3160.3673 3164.7409 3182.4401 3193.8248
redmass: 2.1105 2.6454 3.4997 1.8696 2.6097 5.1098 2.3912 3.1588 2.6410 1.9401 1.4587 2.6204 1.5526 1.5703 2.0486 1.7643 2.4647 1.7025 1.5465 1.6898 2.0589 1.2425 2.1658 1.2860 1.5152 1.6349 1.2600 1.3134 1.3254 1.3690 1.3203 1.3848 1.2760 1.3002 1.2687 1.2282 1.3773 1.4093 1.0916 1.0851 1.0915 1.1132 1.1058 3.9963 1.0625 1.0687 1.0632 1.0582 1.0942 1.0643 1.0904 1.1002 1.1049 1.1101 1.0913 1.1064 1.0911
irintensity: 0.6149 9.0728 16.2422 0.8093 0.8211 22.4249 4.5786 5.0644 1.5851 0.7121 7.1046 3.2678 0.0884 7.8194 9.1655 4.7167 1.9611 10.2598 7.8811 2.3353 4.2456 18.0813 0.7045 2.4912 8.4355 4.0463 1.4641 9.4277 6.8845 7.2504 5.1461 9.8930 2.7300 1.2781 11.1199 1.8534 0.4638 1.1533 9.2404 8.9923 10.8682 2.2142 2.9807 7.2540 2.2929 4.1064 7.3637 3.2977 4.3601 2.6040 2.2578 1.5694 3.6855 1.5901 0.7629 0.9458 1.1155
temp: 298.150 k
press: 1.00000 atm
elementType: 6 1 6 1 6 6 6 1 1 6 1 1 6 6 1 1 1 1 1 1 1
symmnumber: 1
zpe: 509696.6 jmol-1
zpe.correction: 0.194133 hartree
zpe.thermalcorrener: 0.201352 hartree
zpe.thermalcorrenthalpy: 0.202296 hartree
zpe.thermalcorrgfe: 0.163230 hartree
zpe.sumelectzpe: -312.174437 hartree
zpe.sumelectthermal: -312.167219 hartree
zpe.sumelectthermalent: -312.166274 hartree
zpe.sumelectthermalfe: -312.205340 hartree
dipole: -0.4684 -0.3159 -0.4031
dipole: 0.6941
quadrupole: -34.1805 -40.8013 -42.2770
quadrupole: -0.3928 -0.2503 0.3400
quadrupole: 4.9058 -1.7150 -3.1907 -0.3928 -0.2503 0.3400
hfenergy: -312.3685706 hartree
pointgroup: C01 [X(C8H13)]
dipole: -0.1555753 -0.133233 -0.1805766 debye
dipolederiv: -0.0219876 -0.0743748 0.0694902 -0.0032185 -0.010982 -0.0481762 -0.1731678 0.0222071 0.1394112 0.0401483 0.0109967 -0.0268772 0.0120618 0.0381729 -0.0140686 0.0174096 -0.0358219 -0.0342858 0.0199289 0.0849041 -0.033146 0.2153016 0.0386104 -0.0408237 0.0295445 0.0349209 0.1214627 0.0350458 -0.0345574 0.0170953 -0.0655421 0.0555143 0.018512 0.0257718 0.0380015 0.0504409 0.2313815 0.1960033 -0.0629013 0.3143866 -0.1847511 -0.0635989 -0.0186099 -0.1669569 0.1042331 0.5408544 -0.087307 -0.0090542 -0.1816099 -0.1580385 0.0540069 -0.0276446 0.2348272 0.183914 -0.0743876 -0.0818433 -0.0406396 -0.2353486 -0.0836506 -0.0310027 0.0060461 -0.0760896 0.0658251 0.0267486 -0.0252925 0.0374608 -0.001872 0.0443915 0.0264005 -0.0070407 0.0462823 -0.0377197 0.0197442 0.0243853 0.0232957 0.0495242 0.0636159 -0.0208452 0.0136088 -0.0318924 0.0480213 0.041865 -0.0171853 0.0016567 0.117703 0.2468934 0.0367258 -0.142417 -0.0768796 0.1275157 0.0573019 0.0302746 -0.0044129 0.0073398 0.0003213 0.016393 0.0522879 0.0492358 -0.0718487 -0.0116507 -0.0277673 -0.0368337 -0.0578662 0.0402963 -0.0181907 -0.0507771 -0.0248939 0.0435773 -0.108434 -0.0079516 -0.0032293 0.0067308 -0.2120174 -0.0849061 0.0177448 0.070228 0.1033147 -0.053765 -0.0038059 0.0621531 -0.1681525 0.7035534 0.1345034 0.3291662 0.0191376 0.0766758 0.0313746 -0.0089603 -0.0388105 0.0038411 0.1314174 0.0017216 -0.0370881 -0.0073517 0.0386196 0.055428 0.0088737 0.0344823 -0.0089011 0.0527621 -0.011809 -0.0186967 -0.0377875 -0.0373973 0.0048591 -0.0167014 0.0402619 -0.0103778 0.0763043 0.0571868 0.0196835 -0.0043761 -0.0546311 0.0644832 0.003646 0.0238229 -0.0589091 -0.0179483 -0.0156496 -0.0007192 -0.0235755 -0.0026718 -0.0259481 0.0487378 -0.011296 0.0662682 0.0432974 0.0176836 0.0167281 0.0147491 0.0345231 0.0908814 -0.0098463 -0.0070735 0.0243521 0.0133885 0.0193786 -0.0223683 -0.0204587 0.0766644 0.0361279 -0.0122284 -0.0354446 -0.0257115 0.1188488 -0.0334414 -0.0294618 -0.0235055 0.0243554 unknown
polarizability: 90.8208897|0.8751142|75.0809576|-1.7086031|2.1659199|64.9715694 unknown
InChI: InChI=1/8C.13H
charge 1 multiplicity 1
21 atoms
C  -1.99249424 0.51847565 0.06578733
H  -2.19844739 0.79367224 1.10339204
C  -2.00023675 -1.02360417 -0.11547826
H  -2.6788961 -1.57488151 0.53585191
C  -0.54242351 -1.08415688 0.29255377
C  0.57013675 -1.05736783 -0.5305591
C  1.90119017 -0.62803466 0.01136653
H  2.02680506 -1.00574375 1.03174956
H  2.7168715 -1.01967607 -0.60146864
C  1.93708586 0.93914747 0.02626278
H  2.14776513 1.30537694 -0.98462259
H  2.74785744 1.28544141 0.67224498
C  0.56741668 1.46781088 0.49273252
C  -0.4899952 0.70707166 -0.26426832
H  0.46340354 -1.27380645 -1.59247267
H  -2.16068238 -1.32210733 -1.15496237
H  0.42981275 1.36782221 1.57476262
H  -0.36242489 0.80311009 -1.34590325
H  -2.64657103 1.08597265 -0.60102237
H  0.46944733 2.53436832 0.24825375
H  -0.36048871 -1.02568088 1.36624977
