program: GRRM
programVersion: 23
method: UwB97XD
basis: Def2SVP scrf=(cpcm,solvent=acetonitrile)
charge: 0
multiplicity: 1
redmass: 15.99097943 18.60139221 9.19895772 6.11176045 6.35544048 10.43761921 11.74323109 7.47005491 6.01818355 7.48618813 6.63939321 4.25076294 7.33612146 6.32878521 6.75410311 8.92698011 8.92515670 9.77539245 4.44814161 4.64543664 4.65137369 1.42795544 3.88728925 12.82846258 4.29990138 3.67938747 12.10723151 3.37559312 8.23512245 3.92132501 3.08523776 4.62836549 2.96054330 4.59447480 3.17985773 1.95081035 1.99274786 2.41353283 2.21627901 3.60694988 1.60715795 2.57685772 4.84986732 4.77989318 4.05544863 2.95988759 3.67346429 3.35781728 2.82218470 4.74655573 4.07157974 4.30778839 5.71575385 4.57054132 3.29198852 3.74691772 4.24099754 4.79873106 4.36403439 5.21597187 5.34339771 6.08733206 5.86174479 5.80887731 4.20330443 4.55277494 12.31129955 3.21432825 2.58233102 1.88657425 4.46819586 2.63083534 1.50551432 2.52393113 1.51070278 3.73928413 3.16107799 2.80498486 3.88119644 11.53159877 1.74528873 2.40045481 2.39263042 1.25875178 2.91527394 1.51698299 1.94194862 1.55052071 3.09540210 1.56576913 1.25496233 2.34783312 1.36671446 1.51987009 5.27898482 1.38699785 1.37427187 1.43355981 1.35086564 1.42678278 1.33686071 2.63179788 5.77162671 1.81010588 2.65436716 2.67080379 2.11053823 1.96716952 1.97401682 1.61843872 1.66958284 1.71009692 1.42680552 1.59563546 2.06360808 1.45202899 1.34560716 1.24267861 1.08731787 1.09295259 1.22231519 1.23388028 1.29056761 1.71255121 1.91877959 2.06659928 2.92599936 2.60110222 2.57087714 1.80553713 1.70410523 2.01950948 1.65545712 1.70860369 2.18072345 4.31287428 3.09428124 4.70623602 1.20762254 1.46489545 2.37865385 4.23807786 1.24842471 5.95267301 3.21624270 1.23126248 2.40542396 1.17365628 1.10315862 1.21379897 2.35726545 1.21147503 2.33390544 2.77929191 3.94534089 2.89444191 1.26921490 2.39318630 2.79272845 4.01773281 6.45499857 8.20907398 6.39363535 6.36819595 7.69372784 6.52345687 6.22664619 6.26568163 7.09859209 8.51970709 1.07615083 1.09261131 1.04914881 1.03620647 1.03612772 1.08997219 1.10457532 1.10444316 1.10664753 1.08859882 1.08751757 1.08847077 1.10934726 1.08913929 1.09271163 1.09134514 1.09226995 1.09438845 1.09443773 1.09750861 1.09915074 1.09938403 1.09718467 1.10556579 1.08508821 1.08651789 1.09182145 1.10350662
temp: 298.15 k
press: 1.00 atm
energy: -2889.554106633173 hartree
zpe.correction: 0.529873932880 hartree
zpe.sumelectzpe: -2889.024232700292 hartree
zpe.thermalcorrenthalpy: 0.568138314261 hartree
zpe.sumelectthermalent: -2888.985968318912 hartree
symmnumber: 1 hartree.K-1
zpe.thermalcorrgfe: 0.459222180282 hartree
zpe.sumelectthermalfe: -2889.094884452891 hartree
formula: C29H28BFN4O3K2
InChI: InChI=1/C28H27BN4.CHO3.F.2K/c1-28(21-12-5-4-6-13-21)23-15-9-10-16-24(23)33(29-27-31(2)19-30-32(27)3)25-18-17-20-11-7-8-14-22(20)26(25)28;2-1(3)4;;;/h4-19H,29H2,1-3H3;2H;;;/q;-1;;;+1/rC28H27BN4.CHK2O3.F/c1-28(21-12-5-4-6-13-21)23-15-9-10-16-24(23)33(29-27-31(2)19-30-32(27)3)25-18-17-20-11-7-8-14-22(20)26(25)28;2-4-1-3(5-1)6(1)2;/h4-19H,29H2,1-3H3;4H;
68 atoms
C  0.01510463 0.3236993 0.48326777
N  1.40527684 -1.16987844 1.40928904
C  1.87821033 -0.78747565 0.26078227
N  1.08879688 0.15391347 -0.31488375
N  0.25301508 -0.47326163 1.52981929
C  -0.52932895 -0.61541188 2.73831621
C  1.14086178 0.51999181 -1.72166252
H  -1.51446885 -0.17055574 2.57097517
H  -0.6315762 -1.68202907 2.97088777
H  -0.03172654 -0.09647693 3.56958661
H  2.17854001 0.43315585 -2.06834958
H  0.78255504 1.54680004 -1.85846399
H  0.4651142 -0.23290852 -2.17710705
H  2.79676899 -1.15789577 -0.18846577
B  -1.24667672 1.30322015 0.25198538
H  -2.23518184 0.74211458 0.73722973
H  -1.40137352 1.46903585 -0.94376152
N  -1.0393275 2.72720614 0.94775588
C  -0.50501258 2.7001937 2.25641267
C  -2.1796551 3.54362216 0.78054687
C  -1.25264493 2.92660988 3.40229109
C  0.89336553 2.42399761 2.35237561
C  -3.00582493 3.88284942 1.85775908
C  -2.47621097 4.02480735 -0.50707874
C  -2.73119495 3.33464723 3.26774731
C  -0.63123695 2.70621469 4.68808179
C  1.51182779 2.28766465 3.55871417
H  1.46432598 2.33915606 1.42777628
C  -4.13454008 4.67897055 1.61172541
C  -3.5990401 4.80946624 -0.72972596
H  -1.78769752 3.78145969 -1.32017725
C  -3.06862188 4.47181764 4.24762287
C  -3.61479928 2.08235607 3.45206445
C  0.76090004 2.39257402 4.76084904
C  -1.34191168 2.73258641 5.92561028
H  2.58341388 2.0813502 3.61232261
C  -4.44287488 5.13501616 0.33558384
H  -4.78936768 4.94504642 2.44406965
H  -3.81340169 5.17712172 -1.73627029
C  -2.22067418 5.58584803 4.30402747
C  -4.21260375 4.47310673 5.04955713
H  -3.49097795 1.62998198 4.44694899
H  -4.67842095 2.31775686 3.3012618
H  -3.33186308 1.33820748 2.69499773
C  1.38499683 2.17183363 6.01813578
C  -0.71857628 2.49641094 7.12912028
H  -2.40881822 2.93557971 5.93509915
H  -5.33142541 5.74931487 0.17462247
C  -2.49557249 6.65882867 5.14583455
H  -1.32561271 5.60635888 3.67669748
C  -4.49509241 5.54900369 5.8953652
H  -4.89720159 3.62377115 5.03358497
C  0.66643509 2.22408016 7.18708087
H  2.4547067 1.9473539 6.03347195
H  -1.30634649 2.519154 8.04959878
C  -3.63754697 6.64457395 5.95031654
H  -1.81525897 7.51312684 5.17546373
H  -5.39373149 5.52426064 6.51601409
H  1.15332973 2.04729142 8.14836678
H  -3.85611394 7.48432311 6.61356148
F  -0.59652804 -1.61811919 -1.4551969
C  1.12258661 4.25108076 -1.66313029
O  0.99651946 4.08984132 -0.31863835
O  0.25511815 3.76091773 -2.41303644
O  2.14309396 4.89464044 -2.01131631
K  1.58061542 4.53092966 -4.64190793
K  3.2934676 5.28540505 0.41310593
H  0.1986782 3.55732576 -0.04910741
pointgroup: C1
s2: -0.000000000000
