program: GRRM
programVersion: 23
method: UwB97XD
basis: Def2SVP scrf=(cpcm,solvent=acetonitrile)
charge: 0
multiplicity: 1
temp: 298.15 k
press: 1.00 atm
energy: -3492.281690612048 hartree
zpe.correction: 0.812797879795 hartree
zpe.sumelectzpe: -3491.468892732253 hartree
zpe.thermalcorrenthalpy: 0.865742363530 hartree
zpe.sumelectthermalent: -3491.415948248518 hartree
symmnumber: 1 hartree.K-1
zpe.thermalcorrgfe: 0.728824043190 hartree
zpe.sumelectthermalfe: -3491.552866568858 hartree
formula: C46H45BFN3O3K2
InChI: InChI=1/C24H18N.C21H26BN2.CHO3.F.2K/c1-24(18-10-3-2-4-11-18)20-13-7-8-14-21(20)25-22-16-15-17-9-5-6-12-19(17)23(22)24;1-13-9-15(3)19(16(4)10-13)23-7-8-24(21(23)22)20-17(5)11-14(2)12-18(20)6;2-1(3)4;;;/h2-16H,1H3;7-12H,22H2,1-6H3;2H;;;/q;;-1;;;+1/rC24H18N.C21H26BN2.CHK2O3.F/c1-24(18-10-3-2-4-11-18)20-13-7-8-14-21(20)25-22-16-15-17-9-5-6-12-19(17)23(22)24;1-13-9-15(3)19(16(4)10-13)23-7-8-24(21(23)22)20-17(5)11-14(2)12-18(20)6;4-1-2(4)6(1)3(1)5-1;/h2-16H,1H3;7-12H,22H2,1-6H3;4H;
101 atoms
C  0.09105161 0.20150124 0.10133421
C  1.02127901 -1.76447478 0.68002569
C  1.65944635 -1.32387851 -0.42745441
N  1.09141439 -0.10916152 -0.75919648
N  0.08094713 -0.8077429 1.00974164
H  2.47056944 -1.75312229 -1.00728681
H  1.16136959 -2.65964154 1.27730297
B  -1.03078165 1.34304205 -0.1203409
H  -2.05378074 1.18259639 0.4944763
H  -0.93305451 1.96126093 -1.14729187
N  -0.71464684 3.10096023 0.99241306
C  -0.47082509 2.90525159 2.34554557
C  -1.89460523 3.77824025 0.69354339
C  -1.4188398 2.99495155 3.36764799
C  0.89772419 2.66019999 2.68731232
C  -2.95443683 3.92816885 1.60557426
C  -2.02902064 4.34752205 -0.59264894
C  -2.87937219 3.3274971 3.01781218
C  -1.01249092 2.72598549 4.72463461
C  1.31412508 2.53427683 3.97551213
H  1.61373677 2.60232157 1.87012952
C  -4.11783895 4.59591305 1.19673035
C  -3.18771427 5.00586486 -0.97706195
H  -1.17441339 4.28042576 -1.26847422
C  -3.43142578 4.4022139 3.97356968
C  -3.72068134 2.03417547 3.01207364
C  0.36806775 2.52759631 5.03493471
C  -1.92214907 2.61396663 5.8186535
H  2.37225016 2.38180797 4.20275827
C  -4.2547901 5.12555943 -0.08143727
H  -4.94129374 4.70524165 1.90698123
H  -3.25840079 5.43680855 -1.97970652
C  -2.66928436 5.55495481 4.20712939
C  -4.68414167 4.31076723 4.58640201
H  -3.73566942 1.53617293 3.99244058
H  -4.75719663 2.23106159 2.69916426
H  -3.27860967 1.33469903 2.29161294
C  0.78315541 2.26904147 6.36639219
C  -1.49922999 2.34199658 7.09990679
H  -2.98891083 2.73015409 5.64986339
H  -5.17594007 5.63679475 -0.37043164
C  -3.13332221 6.57391247 5.03323341
H  -1.68938872 5.64661829 3.7313054
C  -5.15751258 5.33127455 5.41572687
H  -5.3069661 3.42818829 4.43233775
C  -0.12798756 2.17300478 7.39156472
H  1.850748 2.1278432 6.55791092
H  -2.2393796 2.25032686 7.89860738
C  -4.38453144 6.46634607 5.64581008
H  -2.51570907 7.45946196 5.20176387
H  -6.13902682 5.23180854 5.88539421
H  0.19864792 1.96244428 8.41223675
H  -4.7520257 7.26331899 6.29612094
F  -1.80383448 -0.26347922 -1.3834335
C  1.62261825 5.15801551 -0.84097176
O  1.22715608 4.79220176 0.40180123
O  0.95492964 4.79612975 -1.8294423
O  2.67216141 5.85748744 -0.86608418
K  2.48086749 6.19673252 -3.5345799
K  3.4148061 5.53710396 1.72062634
H  0.46474974 4.10738871 0.4481798
C  -0.66633539 -0.88479836 2.23948249
C  -2.02164171 -1.24802761 2.23347682
C  -2.727653 -1.68963922 0.98365536
H  -2.4076283 -1.13158381 0.08253662
H  -2.51191127 -2.75846312 0.80767565
H  -3.81669665 -1.59804799 1.10942865
C  0.04003046 -0.67904031 3.4368128
C  1.53985702 -0.5462211 3.46622244
H  2.00926936 -1.54038366 3.38928416
H  1.92541549 0.06659368 2.64213473
H  1.86828873 -0.09725865 4.41152908
C  -0.67701804 -0.70208203 4.63512018
H  -0.14645317 -0.49724613 5.56885116
C  -2.04694585 -0.96630772 4.66639832
C  -2.68747526 -1.26566104 3.46240007
H  -3.75082719 -1.52271398 3.47260465
C  -2.82055112 -0.92290545 5.9562723
H  -3.55060997 -1.74356144 6.01602942
H  -2.15483403 -0.97973044 6.82869182
H  -3.37861139 0.02409428 6.03383943
C  1.5456288 0.62367614 -1.91117442
H  3.99777181 2.48134104 -0.44091241
C  3.00571817 2.01508717 -0.37256813
H  3.07235148 1.15317102 0.30631242
H  2.32665164 2.74890855 0.08113123
C  2.50239629 1.62984013 -1.73424475
C  2.99204106 2.28089834 -2.87120712
H  3.73892379 3.06869993 -2.74013022
C  2.56158971 1.94407255 -4.15380201
C  3.07284619 2.67279889 -5.3691714
H  3.34459307 1.9712039 -6.17140101
H  2.29789282 3.34294992 -5.7750251
H  3.95509681 3.28383323 -5.13216791
C  1.6383391 0.9011112 -4.28984846
H  1.3154419 0.60060538 -5.29092199
C  1.12854694 0.2097892 -3.18952234
C  0.18850962 -0.94736535 -3.36523739
H  -0.12539166 -1.03393138 -4.41501233
H  0.68350587 -1.89272562 -3.08642323
H  -0.68886079 -0.81146351 -2.70067535
pointgroup: C1
s2: -0.000000000000
