program: GRRM
programVersion: 23
method: UwB97XD
basis: Def2SVP scrf=(cpcm,solvent=acetonitrile)
charge: -1
multiplicity: 1
frequency: 211.91127658 284.37521298 309.76609220 329.80430501 357.13055037 381.40529852 442.16986806 461.14066725 464.96811167 553.76917174 859.91795165 953.46179547 965.26966139 1022.81423191 1046.09398105 1064.05727644 1111.73736348 1125.69740146 1149.13189581 1234.47524035 1297.25197024 1306.09273854 1409.05303046 1417.74951739 1440.04237429 1448.06073007 1458.43169484 1460.97530742 1467.56308683 1471.00796133 1488.40527324 2148.77770644 2158.73944371 3021.07240867 3035.14937073 3038.86062951 3150.98813277 3152.62472017 3154.59596849 3191.92567898 3195.06767853 3202.52246115
redmass: 1.02802578 1.17757128 1.04524359 1.04502199 2.60274726 2.17208120 2.90224329 2.40453816 2.44135729 3.10661671 2.92740390 1.30376961 1.20574931 1.78181321 1.64030872 1.20161543 1.30084004 1.34164394 1.12436666 1.76157197 2.41458275 2.54390834 1.16721268 1.17812712 1.06546867 1.05903728 1.12303433 1.05759078 1.08269193 1.08552929 1.04262578 1.09695887 1.06156730 1.04680009 1.04147702 1.04380080 1.09189068 1.09653930 1.09383353 1.10685799 1.10645735 1.10750708
temp: 298.15 k
press: 1.00 atm
energy: -200.319824394219 hartree
zpe.correction: 0.142258020694 hartree
zpe.sumelectzpe: -200.177566373525 hartree
zpe.thermalcorrenthalpy: 0.149855296513 hartree
zpe.sumelectthermalent: -200.169969097706 hartree
symmnumber: 1 hartree.K-1
zpe.thermalcorrgfe: 0.113509313368 hartree
zpe.sumelectthermalfe: -200.206315080851 hartree
formula: C3H11BN
InChI: InChI=1/C3H11BN/c1-5(2,3)4/h4H2,1-3H3
16 atoms
B  1.23805369 0.31299129 1.36507879
H  0.22201318 0.93859579 1.78637134
H  2.1649865 0.70591803 2.132169
N  1.59558436 1.25279608 -0.02636452
C  0.52072939 1.08466566 -1.01811229
H  0.7332751 1.66767616 -1.93087915
H  0.42676523 0.01915465 -1.25843344
H  -0.42499165 1.42733886 -0.57931193
C  2.86575826 0.79998548 -0.61731335
H  3.10922571 1.38586035 -1.52047887
H  3.66732966 0.92254405 0.12215154
H  2.78146763 -0.26408704 -0.8662066
C  1.71803179 2.69116024 0.28676913
H  0.7749647 3.04173864 0.72187471
H  2.51858181 2.82745078 1.02313656
H  1.94703883 3.28226849 -0.61825281
pointgroup: C1
s2: -0.000000000000
