program: Gaussian 09
title: 000050632
version: EM64L-G09RevD.01
frameworkgroup: C1[X(C13H21NO3)]
method: RPBEPBE
basis: SDD
operation: Freq
keyword: #p
keyword: freq=noraman
keyword: PBEPBE/SDD
title: #p freq=noraman PBEPBE/SDD
converged: YES YES NO NO
title: Mulliken charges:
elementType: O O O N C C C C C C C C C C C C C H H H H H H H H H H H H H H H H H H H H H
charge: -0.466914 -0.303075 -0.270012 -0.095170 0.156604 -0.363825 0.375171 -0.768593 0.191891 -0.544874 -0.639597 -0.621141 0.332593 -0.361608 -0.389139 -0.542655 -0.536543 0.199348 0.222971 0.226788 0.207604 0.259565 0.278831 0.335217 0.279578 0.178362 0.208965 0.216898 0.183732 0.223246 0.231876 0.237690 0.219210 0.222260 0.239555 0.214864 0.242171 0.218156
chargesum: 0.00000
title: Mulliken charges with hydrogens summed into heavy atoms:
elementType: O O O N C C C C C C C C C C C C C
charge: -0.131697 -0.303075 -0.270012 -0.095170 0.156604 0.058495 0.375171 -0.074636 0.191891 -0.266043 0.027308 0.002735 0.332593 -0.129733 -0.151449 0.138370 0.138648
polarizability: 1.89859331e+02 1.41334743e+01 1.63697270e+02 1.07644907e+01 -8.39792553e+00 1.28277772e+02
1716.lowfreq: -6.6687 0.0005 0.0007 0.0009 9.7080 12.0429 28.2265 40.2924 50.3229
frequency: 27.8581 40.2121 50.2929 74.8390 91.0433 115.3330 156.4290 167.3227 179.7732 184.4816 215.9318 228.0864 231.3381 248.1432 263.3823 263.9620 278.5068 288.8734 314.9598 330.8472 339.9169 358.6292 379.1267 390.0722 393.6802 431.0043 461.8569 510.2320 533.0733 549.5180 585.4308 630.9310 681.2086 704.2637 742.3127 789.5346 811.7251 824.2546 869.4335 895.4394 913.8521 924.4297 969.5788 989.3346 1009.8191 1042.1505 1051.0395 1053.5674 1073.7396 1086.1396 1094.3683 1112.3086 1112.5651 1128.7577 1138.4206 1155.0021 1160.2353 1182.5853 1198.8317 1211.7675 1242.8604 1269.3801 1279.5677 1300.3043 1317.7043 1363.2590 1380.5428 1386.1945 1417.8349 1418.5836 1432.0461 1437.9131 1438.2403 1456.6520 1460.4119 1461.4884 1464.5457 1466.7572 1470.7746 1472.8748 1475.6227 1480.8915 1487.1080 1488.1747 1488.9232 1587.2323 1624.4834 2832.0582 2845.4860 2872.1114 2950.1982 2954.5576 2978.1485 3008.3559 3022.7839 3033.9510 3040.0687 3067.1891 3069.4643 3073.6407 3110.7792 3114.0195 3116.7945 3119.7535 3148.7586 3168.8676 3170.8095 3535.4605
redmass: 3.1960 3.4809 3.0108 3.1747 3.4605 3.3290 3.7544 3.2852 2.6123 3.1284 1.3398 1.1187 1.1894 1.0811 2.4803 1.2780 2.4917 3.5722 2.9088 1.3610 3.0972 3.2241 3.5272 2.3341 4.2813 2.4076 2.9613 4.0721 3.2809 3.7645 3.9648 3.6706 6.0858 5.0802 3.6463 1.5147 4.3011 4.8032 3.9858 1.4052 1.4747 1.9020 1.6606 7.8156 5.2719 1.5347 2.0481 2.2242 2.6876 1.4643 1.5130 1.2611 1.2613 1.4674 1.4492 1.3618 1.6230 2.1106 1.8012 3.0838 3.5621 1.5561 2.7649 1.7383 1.4575 1.3239 1.5779 3.1846 1.4561 1.6658 1.1340 1.4120 1.1789 1.0927 1.0986 1.0766 1.0514 1.0518 1.1752 1.1026 1.0869 1.0538 1.0976 1.4628 1.1552 7.4302 6.9918 1.0581 1.0594 1.0694 1.0334 1.0330 1.0376 1.0704 1.0749 1.1035 1.1036 1.0962 1.0982 1.0918 1.0983 1.0972 1.0992 1.0986 1.0865 1.0929 1.0930 1.0657
irintensity: 0.2247 0.7323 2.6055 3.5117 1.0312 3.2715 2.4952 3.4593 1.7496 4.1939 2.4166 0.3793 0.3393 1.2537 0.4492 0.7915 6.3126 10.8449 7.1549 94.0190 9.8408 19.3563 13.7193 30.5240 7.0362 0.6906 0.7314 5.5797 15.6412 12.6107 4.4888 2.1536 26.9654 8.5816 1.4487 54.1027 20.7005 16.9329 16.3842 1.5813 19.4026 5.2172 0.2517 40.6884 87.3746 10.8897 61.3615 54.0642 9.9012 21.1502 50.6167 0.0890 0.3969 13.4592 6.7002 3.8817 3.7894 160.5551 62.0036 27.4371 14.4865 65.4722 15.8120 28.7848 37.6087 3.9344 16.0442 14.5637 37.5198 57.1279 1.3392 4.7103 5.1345 12.6052 10.9391 30.8242 13.4853 12.5504 142.6758 22.0581 1.9824 7.6777 3.5748 53.8381 14.2557 22.7392 16.7948 93.9704 189.7210 171.0299 72.0140 76.3960 35.5504 37.9730 47.3421 54.2371 49.7038 13.7453 40.9686 27.7403 9.0775 5.9100 25.8180 25.9565 11.9778 6.1850 10.6325 7.9030
temp: 298.150 k
press: 1.00000 atm
elementType: 8 8 8 7 6 6 6 6 6 6 6 6 6 6 6 6 6 1 1 1 1 1 1 1 1 1 1 1 1 1 1 1 1 1 1 1 1 1
symmnumber: 1
zpe: 837657.4 jmol-1
zpe.correction: 0.319047 hartree
zpe.thermalcorrener: 0.338350 hartree
zpe.thermalcorrenthalpy: 0.339294 hartree
zpe.thermalcorrgfe: 0.271993 hartree
zpe.sumelectzpe: -787.007625 hartree
zpe.sumelectthermal: -786.988322 hartree
zpe.sumelectthermalent: -786.987378 hartree
zpe.sumelectthermalfe: -787.054679 hartree
dipole: -1.5179 3.4785 -0.5729
dipole: 3.8382
quadrupole: -90.5826 -96.1328 -99.5830
quadrupole: 1.8009 2.7073 -3.1214
quadrupole: 4.8502 -0.7000 -4.1502 1.8009 2.7073 -3.1214
hfenergy: -787.326672 hartree
pointgroup: C01 [X(C13H21N1O3)]
dipole: -0.6945265 1.2802627 -0.3985977 debye
polarizability: 187.1921331|17.4663455|163.6025707|10.2750848|-11.6504439|131.0396693 unknown
InChI: InChI=1S/C13H21NO3/c1-13(15,9-14(2)3)11-8-10(16-4)6-7-12(11)17-5/h6-8,15H,9H2,1-5H3
charge 0 multiplicity 1
38 atoms
O  1.313968 -1.500682 1.916256
O  0.768295 2.288039 -0.15918
O  -3.252224 -1.649712 0.209537
N  2.201197 -1.024242 -0.989312
C  1.332589 -0.165203 1.260892
C  2.487703 -0.229842 0.2175
C  -0.029549 0.128869 0.599012
C  1.673906 0.881498 2.351478
C  -0.297277 1.356058 -0.085924
C  -1.05718 -0.828423 0.650247
C  2.343513 -2.482605 -0.809838
C  2.904415 -0.535077 -2.187727
C  -2.328984 -0.593892 0.071822
C  -1.560839 1.594882 -0.663452
C  -2.589416 0.625136 -0.586467
C  0.529985 3.531132 -0.889755
C  -4.562744 -1.470748 -0.412289
H  3.389148 -0.596641 0.769686
H  2.678605 0.809792 -0.097075
H  2.658003 0.643898 2.794479
H  0.912886 0.861247 3.155463
H  1.697482 1.898882 1.930529
H  -0.866815 -1.799646 1.114116
H  0.742547 -1.440613 2.725092
H  1.774701 -2.799808 0.076465
H  3.409583 -2.800041 -0.670014
H  1.945107 -3.004122 -1.699769
H  2.551479 -1.093493 -3.074556
H  4.018856 -0.651699 -2.138243
H  2.677955 0.534843 -2.345644
H  -1.766603 2.534699 -1.183978
H  -3.560702 0.837144 -1.042697
H  -0.274264 4.131151 -0.419694
H  0.270999 3.333718 -1.948584
H  1.480265 4.083772 -0.837707
H  -5.107961 -0.612555 0.029383
H  -5.111451 -2.401716 -0.206104
H  -4.474378 -1.3250 -1.507445
