program: GRRM
programVersion: 23
method: UwB97XD
basis: Def2SVP scrf=(cpcm,solvent=acetonitrile)
charge: 1
multiplicity: 1
frequency: 71.91219033 78.89999317 165.21757967 193.83154701 218.22456311 274.77058143 289.47087042 343.98077861 472.47690886 487.43912016 517.55258986 527.73267736 536.15636250 602.80746091 698.30798198 907.67099985 917.74616835 937.75272825 975.35018555 1000.39501744 1002.49115977 1016.54462996 1040.95321391 1050.67958623 1062.67872963 1066.58703611 1076.85241251 1207.05953170 1213.82446955 1256.48041675 1341.52433818 1342.07942626 1386.16564746 1406.63545325 1410.16984158 1447.05670231 1453.72932654 1455.99916426 1458.12118801 1505.32028084 1523.31969039 1680.39739025 1696.41632026 2659.22654876 2786.22848057 3071.22984750 3071.60349041 3166.60293008 3166.86125386 3190.24528339 3190.78505502 3213.89960147 3259.82820305 3262.85734206
redmass: 1.02996381 1.03940618 3.13908840 2.90924685 2.02426435 2.54367747 2.50957592 1.21556849 2.43850754 3.40712450 2.63562444 5.43641218 5.03937922 4.27349858 2.17367715 1.43929726 1.45883088 1.36298469 2.27515528 1.31813136 2.33056684 1.41299535 2.09290518 1.62017534 1.56782995 3.92234551 1.66944005 1.39216968 1.40575108 1.36376849 2.65457950 1.23732124 3.80851144 1.44291233 1.38617383 1.46058367 1.05993794 1.06319025 1.10446560 2.00377125 3.36108520 6.01923776 5.71815262 1.04863148 1.13958208 1.03784526 1.03790421 1.10376547 1.10384286 1.10592493 1.10589638 1.09432640 1.09546607 1.09830334
temp: 298.15 k
press: 1.00 atm
energy: -352.456553399905 hartree
zpe.correction: 0.169400325515 hartree
zpe.sumelectzpe: -352.287153074390 hartree
zpe.thermalcorrenthalpy: 0.179650978450 hartree
zpe.sumelectthermalent: -352.276902421455 hartree
symmnumber: 1 hartree.K-1
zpe.thermalcorrgfe: 0.135185208829 hartree
zpe.sumelectthermalfe: -352.321368191076 hartree
formula: C7H11BN
InChI: InChI=1/C7H11BN/c1-6-3-7(2)5-9(8)4-6/h3-5H,8H2,1-2H3
20 atoms
B  1.55628709 0.46735151 1.17574595
H  1.38833418 1.09441984 2.17913094
H  1.57536257 -0.72480869 1.09422412
C  1.74653268 2.59373661 -0.03916875
C  1.94866411 0.57192815 -1.24694848
C  1.92687156 3.34826634 -1.18451634
H  1.58791306 3.04483754 0.94035303
C  2.13679217 1.24961147 -2.43814333
H  1.94416852 -0.5164044 -1.18748984
C  2.12141268 2.64953128 -2.38318908
N  1.75765904 1.2348707 -0.0757096
H  2.26650321 3.21627894 -3.30706958
C  2.34982083 0.51533488 -3.72905141
H  2.29466092 -0.57103072 -3.58762083
H  1.58970305 0.81098398 -4.46590509
H  3.33535012 0.76290425 -4.14894806
C  1.91089658 4.84802092 -1.14406591
H  2.8483075 5.25023275 -1.55345465
H  1.08549899 5.23533437 -1.75855783
H  1.78786597 5.22243663 -0.12041561
pointgroup: C1
s2: -0.000000000000
