program: GRRM
programVersion: 23
method: UwB97XD
basis: Def2SVP scrf=(cpcm,solvent=acetonitrile)
charge: 0
multiplicity: 2
frequency: 101.05377308 104.04259981 154.96565577 174.08631222 244.04154738 271.12448884 294.13800904 464.03210621 470.97028482 490.04569914 509.26373371 516.48026880 530.85794254 605.36228816 646.61744574 769.01576127 818.12511558 830.37625311 908.15520898 921.30032249 958.05342199 996.34146613 1001.82652086 1022.56907239 1050.98139155 1051.10726610 1058.66218766 1183.14715998 1190.50782172 1267.48684790 1308.15517937 1347.83910646 1363.00105527 1382.17013516 1401.85493115 1416.82334966 1425.37976481 1451.48672986 1452.11270231 1463.72368121 1475.89198113 1619.59777633 1664.52450580 2575.64106502 2666.35699833 3053.59896726 3054.18158117 3141.85894686 3142.18590590 3166.54590121 3166.72427878 3211.08297776 3241.93792501 3245.80228761
redmass: 1.04265478 1.07334049 3.20568090 2.70993668 2.50603628 2.52345893 2.47481073 1.10753089 2.38859015 3.50708116 5.52006186 2.57625318 4.84701519 4.35004819 1.87043200 1.57540101 1.40277073 1.36257075 1.50029285 1.41463907 1.84826116 2.75133551 4.97085977 1.48540245 1.51532926 1.53082772 2.10058896 1.49296041 1.23416443 1.60360626 1.36958644 3.57778174 2.25288134 3.36728899 1.39823845 1.95167060 1.98467031 1.04082102 1.04011694 1.08026268 1.31103633 4.66272405 5.76680978 1.05475467 1.13325938 1.03794284 1.03799297 1.10310394 1.10311282 1.10503297 1.10497190 1.09174211 1.09147971 1.09489473
temp: 298.15 k
press: 1.00 atm
energy: -352.597784441605 hartree
zpe.correction: 0.166404684193 hartree
zpe.sumelectzpe: -352.431379757412 hartree
zpe.thermalcorrenthalpy: 0.176621771911 hartree
zpe.sumelectthermalent: -352.421162669694 hartree
symmnumber: 2 hartree.K-1
zpe.thermalcorrgfe: 0.132637702463 hartree
zpe.sumelectthermalfe: -352.465146739142 hartree
formula: C7H11BN
InChI: InChI=1/C7H11BN/c1-6-3-7(2)5-9(8)4-6/h3-5H,8H2,1-2H3
20 atoms
B  1.3261754 0.47612594 1.12413543
H  1.15457659 1.0847683 2.15129373
H  1.25402777 -0.72563252 1.04973493
C  1.72657746 2.60863319 -0.04239451
C  1.83917359 0.56807867 -1.28346543
C  2.01555215 3.33929123 -1.16591044
H  1.55639136 3.07336351 0.92893561
C  2.13085461 1.25289955 -2.43479929
H  1.75445722 -0.51840723 -1.25583027
C  2.22461043 2.66517771 -2.39348662
N  1.62787782 1.21065176 -0.05597385
H  2.45601085 3.22927022 -3.29980768
C  2.34891948 0.51332225 -3.72706803
H  3.35584872 0.71428758 -4.12387418
H  2.24015392 -0.5722907 -3.59937345
H  1.62782128 0.84449404 -4.48997972
C  2.10967045 4.83957025 -1.09637627
H  3.10760485 5.18064632 -1.41189065
H  1.37842749 5.30584861 -1.77425383
H  1.92387341 5.21373769 -0.08041582
pointgroup: C2v
s2: 0.791084754924
