program: GRRM
programVersion: 23
method: UwB97XD
basis: Def2SVP scrf=(cpcm,solvent=acetonitrile)
charge: 1
multiplicity: 1
frequency: 73.13392691 122.65426800 140.14108553 241.21488678 257.27097083 294.11437141 314.09673616 320.18073016 475.35630337 595.68100600 691.43120992 710.02595807 726.86329591 764.23577629 870.25483009 914.15715374 974.32384523 1062.51629906 1097.10230932 1140.27082120 1146.15784626 1149.78328750 1202.58966163 1246.38031313 1298.32553902 1374.17434043 1433.44050921 1437.51075176 1451.76981593 1452.90905328 1461.98126491 1465.02662772 1472.11883096 1503.42022484 1579.10712533 1634.09098546 2655.49419846 2766.73588603 3104.60379244 3106.18969197 3221.24255148 3224.99025687 3233.95725084 3254.04782209 3309.36108805
redmass: 1.06539383 1.05432494 2.62551931 1.03857394 3.55933774 2.56164038 3.49476602 2.62972291 2.66253883 4.56774924 3.25368722 4.12403340 6.00563124 2.67362060 1.90405444 1.44783212 1.46075333 1.99775281 1.61819855 2.55437358 1.36188502 1.36609034 1.30458860 1.47427332 2.51493024 6.01150681 1.41056968 1.69106490 1.88610400 1.04457472 1.29010266 1.03538532 1.92343591 1.61934820 5.80048291 5.72409901 1.05316677 1.13373685 1.03316040 1.03365777 1.10965367 1.11009077 1.10910478 1.10820256 1.10582566
temp: 298.15 k
press: 1.00 atm
energy: -346.402588838904 hartree
zpe.correction: 0.141179033295 hartree
zpe.sumelectzpe: -346.261409805609 hartree
zpe.thermalcorrenthalpy: 0.150490859519 hartree
zpe.sumelectthermalent: -346.252097979385 hartree
symmnumber: 1 hartree.K-1
zpe.thermalcorrgfe: 0.108368206427 hartree
zpe.sumelectthermalfe: -346.294220632477 hartree
formula: C4H9BN3
InChI: InChI=1/C4H9BN3/c1-7-3-6-8(2)4(7)5/h3H,5H2,1-2H3
17 atoms
C  1.56781807 1.10089459 -0.04720957
C  2.62424794 2.13128864 -1.64914375
N  0.78557497 2.00271391 -0.6574719
N  2.75771423 1.1859564 -0.69199266
H  3.41869455 2.42311872 -2.332212
B  1.21432395 0.15363022 1.14652908
H  2.06457975 -0.58726386 1.54849316
H  0.11847541 0.19209335 1.62458919
C  -0.60414204 2.33679835 -0.38089974
H  -0.95739031 1.73884909 0.46241573
H  -0.66296519 3.40387923 -0.13960436
H  -1.19881673 2.11807083 -1.27500841
C  3.96200822 0.40575042 -0.41687732
H  4.29751056 0.5953751 0.60839962
H  3.74988459 -0.65962067 -0.55727201
H  4.73912343 0.7203101 -1.12008823
N  1.4180204 2.64033616 -1.63872565
pointgroup: C1
s2: 0.000000000000
