program: GRRM
programVersion: 23
method: UwB97XD
basis: Def2SVP scrf=(cpcm,solvent=acetonitrile)
charge: -1
multiplicity: 1
frequency: 21.01715133 30.74617409 35.01347293 35.82005936 39.22467422 63.55131033 76.18500655 83.44851239 116.99941386 129.77696768 134.47679483 142.78911827 143.59651639 173.40826941 192.05340391 202.75713029 205.13802715 210.57133421 241.10823289 243.37319652 280.67464070 282.98483028 289.06872165 308.87749802 326.25364695 333.57031474 333.75716629 400.68663971 402.85380796 470.66569135 513.67505326 514.07445847 535.98081085 537.86691519 546.86854192 551.79839581 557.67422519 583.09007938 587.23442256 587.96487710 597.29626207 602.44115970 609.32471274 621.40847153 645.01950327 658.24975405 666.16438186 712.87844837 775.79273309 789.48413240 809.60685941 829.41085504 888.88016421 889.13396213 918.74003424 919.21262826 933.23419016 955.08029082 958.26888052 963.46931959 984.97467340 992.87154160 1027.52726072 1028.61216541 1031.48430512 1032.37746125 1050.83853836 1053.47465808 1056.11026070 1057.08173534 1059.42816881 1060.45163177 1061.64696511 1063.40181142 1103.92559360 1104.57893117 1120.38489209 1190.46157988 1193.35709884 1218.83208620 1251.33906120 1269.00030989 1269.70002074 1310.02911167 1329.17561444 1338.01359938 1342.03763477 1348.05851784 1383.37805276 1392.75254016 1395.37409200 1395.88457225 1400.79670855 1411.75103846 1413.27328691 1422.30836517 1435.25355823 1435.91199183 1443.93492301 1444.22755283 1448.15238976 1450.53422728 1455.73417744 1456.90433865 1457.37696662 1459.11509862 1460.59482529 1462.89304240 1475.31893937 1503.74943674 1505.07363015 1549.77565312 1562.17443157 1663.91860109 1664.83853635 1691.34006496 1696.98233123 1698.51045466 2448.56837091 2485.79691311 3032.59213866 3032.76793591 3047.99829359 3048.02616738 3051.53712907 3052.27997449 3122.70024781 3122.92621293 3133.63129561 3133.64255573 3137.72484791 3138.38321098 3157.10847577 3157.13792654 3159.85966797 3159.88833816 3166.23318482 3167.46807425 3180.40092266 3180.40955426 3182.36706539 3182.45135234 3270.91070517 3294.28086686
redmass: 4.06597147 3.45631860 1.07434532 1.03026914 3.34233359 3.74117634 3.43898546 2.83575288 1.09523225 1.12832476 2.25231084 1.30750763 1.28717213 3.38177316 2.31058380 2.70814294 4.09565934 3.43980814 2.81267751 2.80352119 2.59708879 2.52234964 2.76669543 2.89776160 3.44937916 3.76357954 3.24961593 4.37276934 4.44258298 3.10534912 3.43046304 3.39417807 2.79113584 3.01872194 2.93085120 2.53546930 1.33176539 4.65821906 3.97804770 3.69192189 3.41943841 2.34659155 2.88792666 3.82093932 2.32231989 3.46246695 1.43122328 3.85052509 2.75297697 4.27928925 2.08093399 1.38124664 1.27822357 1.28264072 1.30282393 1.30291074 4.25568162 2.32255951 2.04407324 2.19664674 3.16226008 3.55727541 1.60197307 1.58020880 1.58236107 1.60008855 1.57689300 1.57323496 1.68631168 1.79005229 1.57572969 1.93751840 1.69038590 1.66194020 1.37453956 2.92548648 1.33684303 1.49174925 1.40250221 3.55344708 3.15667467 1.34384312 1.41789979 2.67478903 2.68421762 3.61058376 5.50162386 2.87573273 2.17996147 1.28528994 1.28572431 1.29756348 1.63673873 1.74119360 1.73650990 2.10587734 1.25364936 1.27841159 1.11187375 1.08561639 1.23977377 1.04844021 1.18981664 1.06372419 1.05946546 1.15430744 1.10339619 1.30215269 3.01093307 2.58214821 2.61504989 4.55650528 5.17088904 8.22071370 8.26866115 6.45445987 6.92676144 6.86085963 1.06440137 1.12256944 1.03937233 1.03930467 1.03898491 1.03898031 1.03891444 1.03902339 1.10047025 1.10044907 1.10166612 1.10168062 1.10041829 1.10025079 1.10533469 1.10529614 1.10497823 1.10498179 1.10536437 1.10496663 1.09223688 1.09223703 1.09225557 1.09224517 1.08916305 1.11238300
temp: 298.15 k
press: 1.00 atm
energy: -949.361396471696 hartree
zpe.correction: 0.419483665025 hartree
zpe.sumelectzpe: -948.941912806671 hartree
zpe.thermalcorrenthalpy: 0.445258672400 hartree
zpe.sumelectthermalent: -948.916137799296 hartree
symmnumber: 1 hartree.K-1
zpe.thermalcorrgfe: 0.365460606536 hartree
zpe.sumelectthermalfe: -948.995935865160 hartree
formula: C21H26BN2
InChI: InChI=1/C21H26BN2/c1-13-9-15(3)19(16(4)10-13)23-7-8-24(21(23)22)20-17(5)11-14(2)12-18(20)6/h7-12H,22H2,1-6H3
50 atoms
C  -0.00002791 -0.28574288 0.24916181
C  -0.67213555 0.24329923 -1.91416483
C  0.67323203 0.24299705 -1.91387927
H  -1.3703045 0.42015902 -2.72862247
H  1.37182747 0.41955159 -2.72803753
N  1.11242862 -0.15184796 -0.64803635
N  -1.11204831 -0.15134393 -0.64850496
C  -2.4573051 -0.06499673 -0.23100788
C  -3.17110582 -1.24434886 0.05509887
C  -3.07507316 1.19128266 -0.09764772
C  -4.50022125 -1.14484877 0.47069891
C  -4.41424375 1.24633215 0.30606197
C  -5.14431186 0.09165335 0.59671622
H  -5.05435566 -2.06182905 0.69540964
H  -4.8944364 2.22426742 0.4122076
C  2.45753336 -0.06604141 -0.22993652
C  3.17074626 -1.24567659 0.0564281
C  3.07569882 1.19000411 -0.09617552
C  4.49970909 -1.14670201 0.47266232
C  4.41469014 1.2445278 0.30817902
C  5.14419479 0.08954724 0.5990822
H  5.05338907 -2.06390484 0.69758292
H  4.89519157 2.22227643 0.41465212
C  2.49558626 -2.57929058 -0.09261269
C  2.30210332 2.45336436 -0.37065709
H  2.12699257 2.59453245 -1.44925139
C  -2.49639451 -2.57822857 -0.09359033
H  -2.10676906 -2.70826721 -1.1150925
C  -2.30091845 2.45435157 -0.37189309
H  -1.31068656 2.41286704 0.10476368
H  -2.83901591 3.33670565 0.0015444
H  -2.12530953 2.5953873 -1.45042377
H  2.84035096 3.33550522 0.00306785
H  1.31165638 2.41217983 0.10558579
H  1.62834826 -2.63525895 0.58638501
H  2.10625226 -2.70909389 -1.11425502
H  3.18456188 -3.40627563 0.12874403
H  -3.18575901 -3.40493445 0.12759882
H  -1.62940651 -2.6344646 0.58570399
C  -6.59133216 0.16597153 1.01325911
H  -6.8124128 -0.54429546 1.82380606
H  -6.86034412 1.17474511 1.35728722
H  -7.25712417 -0.08574651 0.17164655
C  6.59106008 0.16333135 1.01625817
H  6.85990627 1.17163326 1.36180302
H  6.8118854 -0.54807575 1.82586883
H  7.25716671 -0.08713651 0.17451717
B  -0.00035855 -0.47985812 1.70581723
H  -1.06111761 -0.55685391 2.32041931
H  1.06013623 -0.55732617 2.32082281
pointgroup: Cs
s2: -0.000000000000
