program: GRRM
programVersion: 23
method: UwB97XD
basis: Def2SVP scrf=(cpcm,solvent=acetonitrile)
charge: 1
multiplicity: 1
frequency: 8.25544527 10.15817734 48.59567429 65.33730664 109.42518016 115.81213730 197.14833905 204.23839098 220.02068747 234.45263279 238.26806319 255.45338189 263.59400774 326.96765882 358.72851353 367.41434730 374.03070899 402.81577731 428.98098517 454.71526720 457.56204373 472.08549967 509.54939773 519.87198827 549.82176768 656.27399216 694.07303734 743.25531233 783.66353548 789.99572735 807.06803777 807.73324604 809.79236665 832.30045699 841.84862087 861.30617395 874.46074695 881.00978660 914.12860505 916.73216911 923.65905518 926.56294907 927.63204418 951.64598467 952.33391719 969.50179043 1011.50849717 1027.69766589 1056.11927020 1056.98154648 1081.35613477 1081.69962462 1087.91350581 1100.34865270 1101.71243625 1102.79189901 1138.29943272 1139.96264205 1161.21065759 1171.09126186 1189.74783302 1226.79859406 1227.85314399 1243.51101745 1258.53049218 1276.62484772 1284.95151294 1288.37118884 1289.43362989 1303.15298591 1304.90525900 1331.93035046 1332.28000987 1348.45376362 1349.53164829 1364.60081801 1365.22861152 1388.59390477 1389.94464020 1390.55239102 1392.38312391 1396.72173145 1396.94927850 1400.59391938 1409.83601324 1415.86766528 1458.72341116 1459.53083090 1460.18221777 1462.45177111 1467.82775541 1468.58834763 1469.83790147 1470.93787709 1471.68534239 1482.38939185 1487.23121625 1505.31138610 1545.64318949 1631.52192553 2645.97568414 2744.24976624 3049.88621762 3051.15871545 3053.44871721 3054.60034290 3055.24852003 3055.59622499 3058.64486008 3060.01170298 3060.61894811 3061.06903664 3119.50704725 3120.03195045 3123.26002573 3123.39232361 3124.65773050 3124.77020015 3127.17252522 3127.64079884 3128.33063395 3128.50621104 3157.61850097 3158.72592085 3308.23322021 3323.99754324
redmass: 3.27841982 3.21702423 3.34724550 3.52436909 2.93239750 3.61998457 3.28401906 3.43147429 3.58895546 1.76543820 1.78271789 1.09386611 2.32589004 3.27607213 1.73493605 2.02541988 4.55770709 3.85098384 2.56490249 3.22908396 3.23306367 2.70097014 1.53948879 1.50840454 2.73861516 3.89549690 3.44298807 3.69092876 2.43642401 2.35242867 1.44848923 1.43378788 1.41786708 2.27556106 3.39849799 1.87493536 1.73932029 1.69814220 1.47638469 1.44557612 1.95493076 1.73084566 1.57803470 1.81508348 1.84351149 1.47443700 2.68747666 2.47728067 1.66604217 1.67054167 1.24381785 1.25557264 2.87750032 1.17372982 1.13680031 1.24931932 2.33111895 2.31249289 2.20685905 2.47863711 1.58551097 1.50176944 1.50234307 1.59100673 1.40717539 1.34640993 1.54590428 1.26012026 1.26146498 1.30062191 1.32204586 1.27056183 1.27220882 1.35068920 1.84581056 1.42405183 1.42760873 1.65051127 1.54528763 1.62002728 1.63108964 1.59132909 1.55973387 2.23550181 1.64794146 3.68221759 1.08948719 1.09058699 1.25091496 1.10811140 1.12165543 1.11359795 1.28777703 1.25057002 1.19961135 1.22082042 1.17702031 3.10142052 4.02556049 5.33689403 1.05562808 1.13089956 1.06809619 1.06803903 1.06695181 1.06687477 1.06613541 1.06570047 1.06301056 1.06279232 1.06421564 1.06399147 1.10026437 1.10022246 1.10092558 1.10121470 1.10128191 1.10110956 1.10470922 1.10469889 1.10530756 1.10482815 1.08779967 1.08773985 1.09525866 1.11162536
temp: 298.15 k
press: 1.00 atm
energy: -720.773251606216 hartree
zpe.correction: 0.400992867876 hartree
zpe.sumelectzpe: -720.372258738340 hartree
zpe.thermalcorrenthalpy: 0.418626460530 hartree
zpe.sumelectthermalent: -720.354625145686 hartree
symmnumber: 1 hartree.K-1
zpe.thermalcorrgfe: 0.356784177046 hartree
zpe.sumelectthermalfe: -720.416467429170 hartree
formula: C15H26BN2
InChI: InChI=1/C15H26BN2/c16-15-17(13-7-3-1-4-8-13)11-12-18(15)14-9-5-2-6-10-14/h11-14H,1-10,16H2
44 atoms
C  1.52977188 1.18628114 -0.08546288
C  2.65395788 1.9866621 -1.82516544
C  1.40447366 2.5504153 -1.83310759
N  0.73211207 2.05001121 -0.76636502
N  2.71236234 1.15637188 -0.75382047
H  0.9694471 3.26375931 -2.52667109
H  3.48429068 2.1303766 -2.50996159
B  1.16958881 0.4058468 1.20338367
H  0.08490748 0.53504909 1.69437241
H  1.97897299 -0.32066029 1.70479455
C  -0.65435824 2.41709649 -0.42656787
C  -0.74928149 3.89758425 -0.05444481
C  -1.61141442 2.04146622 -1.55895266
H  -0.91117651 1.81951402 0.45624046
C  -2.18916198 4.25582924 0.31640603
H  -0.42687803 4.51338202 -0.91118128
H  -0.0630874 4.11188186 0.77893131
C  -3.04633122 2.40926165 -1.17813916
H  -1.32798579 2.58283728 -2.47743505
H  -1.5240035 0.96547879 -1.77304546
C  -3.1654766 3.88638738 -0.80108125
H  -2.25069563 5.3300696 0.54546001
H  -2.46902878 3.72053997 1.24026429
H  -3.71912674 2.16703044 -2.01414089
H  -3.36637013 1.78545377 -0.32567097
H  -4.19697891 4.11712284 -0.49460779
H  -2.95304947 4.50666467 -1.68948054
C  3.90124321 0.36102732 -0.39790486
C  4.26212607 -0.61496647 -1.51875161
C  5.07186306 1.27119402 -0.02249298
H  3.61493292 -0.21962717 0.48712934
C  5.48127582 -1.44688696 -1.11754388
H  4.49162322 -0.05280124 -2.43975644
H  3.39842537 -1.26132337 -1.73641312
C  6.2876136 0.42962405 0.36856712
H  5.32998423 1.91200407 -0.88272313
H  4.7712877 1.93543127 0.80204271
C  6.66571127 -0.55812029 -0.73584695
H  5.75230628 -2.11957232 -1.94471667
H  5.21471809 -2.09145452 -0.26209211
H  7.13291631 1.09455997 0.59997794
H  6.06071308 -0.12510721 1.29548891
H  7.51639877 -1.17801343 -0.4145604
H  7.00116017 0.00245895 -1.62594006
pointgroup: C1
s2: -0.000000000000
