program: GRRM
programVersion: 23
method: UwB97XD
basis: Def2SVP scrf=(cpcm,solvent=acetonitrile)
charge: 1
multiplicity: 2
frequency: -279.03917167 43.76459147 147.82649586 148.33677054 325.29241073 392.86834767 452.88727756 481.65995699 563.65382746 600.83995144 605.70675751 617.38074592 625.30249349 838.32536680 838.98056000 851.08415652 861.03613635 863.83139372 869.03210153 889.55387476 904.12872422 917.04932304 919.24884076 973.81414327 979.46633325 982.78107077 989.31717302 1026.51183112 1033.21965553 1037.14179718 1037.79956208 1064.82191123 1065.55307250 1071.11087813 1076.40208034 1164.16178494 1165.46517080 1286.51090298 1288.18889011 1420.49811487 1428.42379679 1432.45460739 1441.86741047 1475.44191468 1485.43366947 1485.86173984 1486.65193159 3269.38474383 3269.56864331 3271.89145974 3272.17342976 3281.60714544 3281.83604793 3282.16905481 3282.38379036 3291.48807630 3291.49306146
redmass: 6.19773956 3.39985810 4.54724670 4.63448326 4.88098231 3.74060815 6.44055111 7.60164258 5.28575848 3.52785851 3.64193820 3.52423083 3.64786320 5.48555149 5.37790531 5.04843800 1.34165927 2.98404841 1.15251203 1.26745405 1.28136912 1.26023465 1.25930645 1.26616732 1.24922024 1.27604873 1.26120326 1.44746790 1.39109436 1.39759577 1.39256271 1.15929474 1.16036157 1.14573990 1.15332784 5.56978404 5.62417679 1.28146567 1.28066340 5.20262452 5.28309501 5.28354433 5.23396998 2.66549166 2.83180632 2.84697059 2.80043315 1.09205259 1.09228621 1.09262748 1.09268736 1.09959112 1.10009446 1.10016065 1.10006258 1.11019644 1.11015278
temp: 298.15 k
press: 1.00 atm
energy: -1650.113458744540 hartree
zpe.correction: 0.172017416312 hartree
zpe.sumelectzpe: -1649.941441328228 hartree
zpe.thermalcorrenthalpy: 0.181862659923 hartree
zpe.sumelectthermalent: -1649.931596084617 hartree
symmnumber: 1 hartree.K-1
zpe.thermalcorrgfe: 0.136199940151 hartree
zpe.sumelectthermalfe: -1649.977258804389 hartree
formula: C10H10Fe
InChI: InChI=1/2C5H5.Fe/c2*1-2-4-5-3-1;/h2*1-5H;/rC10H10Fe/c1-2-4-5-3(1)11(1,2,4,5)6-7(11)9(11)10(11)8(6)11/h1-10H
21 atoms
C  -2.93657305 2.4792517 -2.43424885
C  -4.15963502 1.75562726 -2.3982847
C  -3.8475727 0.36321495 -2.37557436
C  -2.42519164 0.23524559 -2.3932474
C  -1.86864319 1.54495416 -2.42977997
H  -2.8352974 3.56289648 -2.40897078
H  -5.15684595 2.19022093 -2.36083638
H  -4.56522197 -0.45388343 -2.33458581
H  -1.86389605 -0.69661584 -2.35968726
H  -0.80828616 1.7902573 -2.40600262
Fe -3.04832128 1.26530821 -0.70700495
C  -2.93933727 0.05118121 1.02040406
C  -4.16096374 0.77716159 0.98429818
C  -1.86958793 0.9833965 1.01578788
H  -2.84020933 -1.03266461 0.99521995
C  -3.84624912 2.16895142 0.96142603
H  -5.15901662 0.34450739 0.94674756
C  -2.42361405 2.29421329 0.97912108
H  -0.80971444 0.73600621 0.99214865
H  -4.56234061 2.98740838 0.92028104
H  -1.86051977 3.22498692 0.94557864
pointgroup: C1
s2: 0.774061738825
