program: GRRM
programVersion: 23
method: UwB97XD
basis: Def2SVP scrf=(cpcm,solvent=acetonitrile)
charge: 1
multiplicity: 1
frequency: 77.22233779 95.15588738 153.13000551 256.95976088 296.41601146 306.30916335 318.68874009 320.46897534 479.70754997 589.29463654 656.77591507 720.42987200 725.76449928 746.70956537 805.58421643 860.39422365 923.16764644 975.59857205 1073.05265806 1077.75692652 1104.23074951 1139.65810369 1144.90993898 1149.56996607 1204.37617382 1272.90411360 1298.62327181 1425.22422556 1433.52783712 1443.92286316 1449.91684783 1462.46631035 1464.92221600 1466.70647277 1493.86002904 1517.74533882 1571.47540733 1634.21428632 2637.63090135 2742.56778712 3103.42651895 3103.85439000 3220.11334476 3220.60038120 3232.87835303 3233.31329187 3305.98989489 3321.70762469
redmass: 1.04170383 1.09156371 2.58758199 3.28674587 1.61429762 2.45371258 2.54012441 1.56521658 2.47980562 4.60170250 2.90720731 4.51026306 3.91443115 2.98024944 1.25658057 1.77086730 1.44758861 1.44482372 2.46380373 1.65085134 1.17437193 1.82036302 1.34761297 1.36754767 1.24083454 1.44086171 3.21380857 3.74896126 3.03718276 1.22897826 1.67501899 1.23528920 1.03495551 1.03832806 1.47195050 2.10017332 4.37646734 5.03293609 1.05431229 1.13268449 1.03356041 1.03361996 1.10930242 1.10948456 1.10893957 1.10867610 1.09612228 1.11238416
temp: 298.15 k
press: 1.00 atm
energy: -330.402654172002 hartree
zpe.correction: 0.153227098045 hartree
zpe.sumelectzpe: -330.249427073957 hartree
zpe.thermalcorrenthalpy: 0.162580898973 hartree
zpe.sumelectthermalent: -330.240073273029 hartree
symmnumber: 1 hartree.K-1
zpe.thermalcorrgfe: 0.120416217833 hartree
zpe.sumelectthermalfe: -330.282237954169 hartree
formula: C5H10BN2
InChI: InChI=1/C5H10BN2/c1-7-3-4-8(2)5(7)6/h3-4H,6H2,1-2H3
18 atoms
C  -0.11278094 0.55542355 -0.03839711
C  -0.62358572 -1.60061848 0.08514959
C  0.74293878 -1.48136365 0.16989854
N  1.03197392 -0.15961224 0.09272694
N  -1.12439278 -0.34775437 -0.04206103
C  -2.54527203 -0.02737983 -0.153628
C  2.38029883 0.40055637 0.1412906
H  -2.72557782 0.54499031 -1.06990795
H  -3.10689199 -0.96539589 -0.19519035
H  -2.86488793 0.55155313 0.72031594
H  3.08952509 -0.42328504 0.26521806
H  2.46649914 1.08715049 0.99064449
H  2.59623938 0.93017163 -0.79323619
H  1.50812911 -2.24449858 0.27793425
H  -1.25258588 -2.48574152 0.10726167
B  -0.23894014 2.09191372 -0.15652382
H  -1.32815649 2.57979078 -0.27075427
H  0.75510046 2.76174264 -0.13073437
pointgroup: C1
s2: -0.000000000000
