program: Gaussian 09
title: 000006890
version: EM64L-G09RevD.01
frameworkgroup: C1[X(C11H14N2)]
method: RPBEPBE
basis: SDD
operation: Freq
keyword: #pfreq=noraman
keyword: PBEPBE/SDD
title: #p freq=noraman PBEPBE/SDD
converged: YES YES NO NO
title: Mulliken charges:
elementType: N N C C C C C C C C C C C H H H H H H H H H H H H H H
charge: -0.083822 -0.409115 0.402935 0.102885 -0.503885 0.223194 -0.448840 -0.400254 -0.354854 -0.627142 -0.614612 -0.251663 -0.218207 0.220563 0.182813 0.269342 0.301836 0.261880 0.224066 0.219649 0.254520 0.179726 0.183467 0.224223 0.224633 0.218099 0.218563
chargesum: 0.00000
title: Mulliken charges with hydrogens summed into heavy atoms:
elementType: N N C C C C C C C C C C C
charge: -0.083822 -0.107279 0.402935 0.102885 -0.100509 0.223194 -0.179498 -0.138374 -0.130788 0.026752 0.017712 -0.033564 0.000356
polarizability: 1.63711087e+02 9.79263228e+00 1.47818620e+02 -1.04347607e+01 1.92062349e+00 7.82126075e+01
1716.lowfreq: -4.8273 -0.0004 -0.0004 -0.0003 7.1519 10.2932 48.3350 72.8684 83.4674
frequency: 48.1852 72.8184 83.4559 174.9833 219.2908 223.8573 241.7051 261.7129 319.6356 336.7290 343.1847 423.3907 433.3376 466.1786 503.9874 534.2428 575.7456 593.4096 627.7390 735.0639 751.3240 756.9426 773.2327 795.0022 820.3852 855.8916 869.1565 936.4294 973.3489 975.2537 1009.2007 1017.3915 1035.8743 1067.8270 1092.7789 1095.4420 1129.6262 1137.0872 1165.1643 1173.1997 1227.2140 1244.5480 1259.1254 1268.4687 1296.6329 1348.7520 1366.8566 1390.5668 1416.7461 1420.8018 1439.7229 1457.1665 1458.9445 1460.8122 1474.1533 1475.4342 1482.8989 1486.7285 1566.2007 1587.8031 1632.0192 2816.3589 2838.8383 2855.3609 2978.1597 3014.3806 3026.1435 3074.1937 3089.1175 3122.0220 3134.0362 3151.3110 3165.5516 3218.6043 3613.8109
redmass: 3.1949 3.0126 3.7197 3.4472 3.6524 1.6909 1.0594 1.7004 2.4906 3.0861 2.9597 2.8653 2.6291 3.2289 1.2405 5.8902 3.1567 4.1365 3.4903 4.0655 1.3377 4.4740 3.6433 1.8710 2.8884 1.4833 5.1284 1.3761 1.7102 1.3521 2.0718 2.3957 1.5266 3.4256 1.2965 1.5147 1.3876 1.4451 1.1027 1.9165 1.7816 2.1123 2.5765 1.6158 1.9891 1.9475 1.4316 5.2414 1.1520 2.2810 1.1804 3.9295 1.0685 1.0817 1.0728 1.0583 2.8868 1.0667 6.2512 6.2348 6.9717 1.0706 1.0576 1.0577 1.0854 1.0712 1.0724 1.1010 1.1000 1.0851 1.0900 1.0954 1.0991 1.0982 1.0808
irintensity: 0.0583 1.2529 1.1695 1.0025 7.3513 2.1932 0.6360 0.7344 7.0157 0.5779 5.8404 12.6456 2.0865 4.0952 91.9345 0.6398 8.5489 7.4386 1.1042 2.1801 112.2755 4.2014 9.7617 18.7315 25.2095 0.3993 1.1683 3.0561 5.8309 1.6728 13.4063 57.7530 14.1181 7.0137 15.3391 32.3651 1.7393 2.2212 0.4199 3.8533 3.4167 16.0399 4.0946 2.5128 5.4356 16.4046 18.4860 37.9314 4.4648 3.5148 6.3111 24.3700 13.4962 3.6518 14.7016 9.5293 2.1302 11.0816 14.1442 0.4891 2.5008 68.7755 79.8451 266.0108 30.9099 41.3254 35.6485 33.7138 31.9535 0.2176 18.6660 29.1694 21.3426 1.2321 56.6125
temp: 298.150 k
press: 1.00000 atm
elementType: 7 7 6 6 6 6 6 6 6 6 6 6 6 1 1 1 1 1 1 1 1 1 1 1 1 1 1
symmnumber: 1
zpe: 595194.2 jmol-1
zpe.correction: 0.226697 hartree
zpe.thermalcorrener: 0.238610 hartree
zpe.thermalcorrenthalpy: 0.239554 hartree
zpe.thermalcorrgfe: 0.188718 hartree
zpe.sumelectzpe: -536.104731 hartree
zpe.sumelectthermal: -536.092819 hartree
zpe.sumelectthermalent: -536.091875 hartree
zpe.sumelectthermalfe: -536.142711 hartree
dipole: 0.2311 2.5283 0.2738
dipole: 2.5535
quadrupole: -68.4157 -67.1032 -81.3919
quadrupole: -4.6459 -2.5833 1.3184
quadrupole: 3.8879 5.2004 -9.0883 -4.6459 -2.5833 1.3184
hfenergy: -536.3314286 hartree
pointgroup: C01 [X(C11H14N2)]
dipole: 0.1944039 0.9681804 -0.1847669 debye
polarizability: 164.1048781|3.6268779|142.0672972|-16.6159628|-15.9660379|83.5701394 unknown
InChI: InChI=1S/C11H14N2/c1-13(2)8-9-7-12-11-6-4-3-5-10(9)11/h3-7,12H,8H2,1-2H3
charge 0 multiplicity 1
27 atoms
N  2.592319 -0.67747 0.171896
N  -1.072352 2.180244 -0.498595
C  0.667899 0.701093 -0.646529
C  -0.51788 -0.017992 -0.206583
C  2.025583 0.120837 -0.94877
C  -1.594608 0.935268 -0.123258
C  0.28841 2.032794 -0.80951
C  -0.769602 -1.374413 0.132186
C  -2.900536 0.570016 0.273332
C  2.784652 0.110864 1.404283
C  3.821489 -1.384453 -0.234915
C  -2.07032 -1.745311 0.5249
C  -3.124051 -0.784833 0.593613
H  1.95326 -0.564172 -1.818477
H  2.717571 0.951164 -1.254556
H  0.887073 2.884237 -1.129288
H  -1.595799 3.051279 -0.541105
H  0.048905 -2.100314 0.103484
H  -3.712501 1.303803 0.332931
H  3.119779 -0.555737 2.219239
H  1.827557 0.56904 1.704347
H  3.542254 0.928999 1.289214
H  4.662285 -0.695104 -0.508795
H  3.611939 -2.028714 -1.108284
H  4.170099 -2.030192 0.590887
H  -2.281903 -2.787462 0.789789
H  -4.124722 -1.105469 0.905267
