program: GRRM
programVersion: 23
method: UwB97XD
basis: Def2SVP scrf=(cpcm,solvent=acetonitrile)
charge: 0
multiplicity: 2
frequency: 117.22249122 130.29533899 146.06437016 237.27460517 238.25930566 303.81791193 311.60100071 412.32716643 472.40080551 587.33823544 610.65789343 638.17142443 714.83995551 732.43031661 741.89119731 744.32359490 843.45164412 862.72178936 1044.82915736 1062.02107706 1099.97995008 1128.99254660 1144.58928438 1146.17137329 1166.21488200 1267.00315527 1287.03169940 1388.92056044 1403.08249514 1444.07772635 1446.64915132 1451.25910006 1454.30259690 1463.40050210 1488.81180451 1513.89140204 1526.45344586 1641.09257378 2533.17646654 2602.56664864 3060.78552020 3061.75025512 3153.33115923 3153.86443576 3196.59511063 3196.78377050 3294.11356881 3313.91415799
redmass: 1.11499922 1.93593882 1.23930967 3.32846508 2.51366665 2.42611150 2.59290173 1.11481506 2.34481432 4.53792897 3.42219849 2.07452391 1.34808161 2.05601088 2.47564325 3.70675666 2.09657458 1.36006000 2.00513474 1.76584019 1.12566065 2.31542841 1.31868234 1.32444334 1.20390165 1.50266211 3.07856759 4.00077205 8.94143776 1.43491675 1.35964856 1.05007998 1.03669728 1.36850293 1.13856081 1.95547268 3.67355641 5.25688039 1.05827396 1.12748844 1.03507015 1.03523568 1.10710303 1.10714374 1.10586986 1.10597480 1.09223891 1.11233283
temp: 298.15 k
press: 1.00 atm
energy: -330.534202459577 hartree
zpe.correction: 0.150315191710 hartree
zpe.sumelectzpe: -330.383887267867 hartree
zpe.thermalcorrenthalpy: 0.159739486992 hartree
zpe.sumelectthermalent: -330.374462972585 hartree
symmnumber: 1 hartree.K-1
zpe.thermalcorrgfe: 0.117218155574 hartree
zpe.sumelectthermalfe: -330.416984304003 hartree
formula: C5H10BN2
InChI: InChI=1/C5H10BN2/c1-7-3-4-8(2)5(7)6/h3-4H,6H2,1-2H3
18 atoms
C  -0.11806955 0.57819506 -0.03829857
C  -0.60302242 -1.62246318 0.15679614
C  0.74978488 -1.505541 0.10634048
N  1.04264212 -0.16536751 -0.01203284
N  -1.12897838 -0.35301614 0.06872779
C  -2.53528265 -0.02472131 0.08591429
C  2.36919291 0.39901731 -0.09942271
H  -2.82354692 0.48809854 -0.84309062
H  -3.11681972 -0.94888624 0.1808214
H  -2.76733152 0.63506578 0.93443927
H  3.10635309 -0.4104697 -0.04744857
H  2.5456793 1.09983391 0.72928935
H  2.49660938 0.94148944 -1.04743394
H  1.52348482 -2.26694231 0.14524124
H  -1.22990252 -2.50483641 0.24806599
B  -0.25228676 2.07908746 -0.15797889
H  0.74498122 2.76535007 -0.24274163
H  -1.35585428 2.58374921 -0.16718117
pointgroup: Cs
s2: 0.758682607351
