program: Gaussian 16
title: Molecule Name
version: ES64L-G16RevC.01
basis: def2SVP
frameworkgroup: OH[O(F)]
method: UwB97XD
operation: Freq
keyword: #p
keyword: UwB97XD/Def2SVP
keyword: scrf=(cpcm,solvent=acetonitrile)
keyword: scf=(xqc,maxcon=128,maxcyc=32,conver=8)
keyword: freq
title: #p UwB97XD/Def2SVP scrf=(cpcm,solvent=acetonitrile) scf=(xqc,maxcon=12
nucrepener: 0.0000000000
basis: NPDir=0 NMtPBC= 1 NCelOv= 1 NCel= 1 NClECP= 1 NCelD= 1
basis: NCelK= 1 NCelE2= 1 NClLst= 1 CellRange= 0.0.
basis: One-electron integrals computed using PRISM.
basis: One-electron integral symmetry used in STVInt
basis: 48 Symmetry operations used in ECPInt.
basis: ECPInt: NShTT= 21 NPrTT= 91 LenC2= 22 LenP2D= 91.
basis: LDataN: DoStor=T MaxTD1= 4 Len= 56
basis: NBasis= 14 RedAO= T EigKep= 1.89D-01 NBF= 5 1 1 1 0 2 2 2
basis: NBsUse= 14 1.00D-06 EigRej= -1.00D+00 NBFU= 5 1 1 1 0 2 2 2
converged: YES YES YES YES
polarizability: 1.21151790e+00 -1.06031045e-18 1.21151790e+00 -3.07616494e-18 -4.28781110e-18 1.21151790e+00
1716.lowfreq: 0.0022 0.0022 0.0022
temp: 298.150 k
press: 1.00000 atm
elementType: 9
zpe: 0.0 jmol-1
zpe.correction: 0.000000 hartree
zpe.thermalcorrener: 0.001416 hartree
zpe.thermalcorrenthalpy: 0.002360 hartree
zpe.thermalcorrgfe: -0.014159 hartree
zpe.sumelectzpe: -99.805669 hartree
zpe.sumelectthermal: -99.804252 hartree
zpe.sumelectthermalent: -99.803308 hartree
zpe.sumelectthermalfe: -99.819827 hartree
dipole: 0.0000 0.0000 0.0000
dipole: 0.0000
quadrupole: -5.8202 -5.8202 -5.8202
quadrupole: 0.0000 0.0000 -0.0000
quadrupole: -0.0000 0.0000 0.0000 0.0000 0.0000 -0.0000
hfenergy: -99.8056688 hartree
pointgroup: OH [O(F1)]
dipole: 0. 0. 0. debye
dipolederiv: -1. 0. 0. 0. -1. 0. 0. 0. -1. unknown
polarizability: 1.2115179|0.|1.2115179|0.|0.|1.2115179 unknown
InChI: InChI=1/F
charge -1 multiplicity 1
1 atoms
F  -3.497921 0.247342 0.590457
