program: GRRM
programVersion: 23
method: UwB97XD
basis: Def2SVP scrf=(cpcm,solvent=acetonitrile)
charge: -1
multiplicity: 2
frequency: 25.79532334 26.74273666 106.77279293 107.83696395 116.30043323 225.26524141 253.92557032 284.47264486 339.48608485 376.46123932 407.74545657 411.49516762 418.12525348 471.31849018 552.42045822 579.67294750 592.07941963 606.70323587 614.34067385 624.97516027 653.65153774 668.66881824 671.05600833 749.97340651 799.49195922 943.48047423 968.96157900 993.13648733 1006.17754279 1034.70751739 1063.84794742 1076.64909616 1080.93744421 1093.95468383 1146.16724993 1163.14079053 1225.23544419 1297.40798363 1370.12849846 1390.27635266 1429.26289454 1502.50578520 1518.72412488 1581.90653156 3165.50971320 3208.91646195 3215.10591852 3217.90081101
redmass: 15.52375518 14.86206967 5.67410879 6.56872294 13.89223579 8.29731068 5.84440276 15.44578076 8.44255574 5.37101445 12.40156376 7.26279025 4.04851651 11.74279211 8.95926720 16.20469673 10.89965127 1.18110130 3.57189996 1.84192955 7.58927571 6.55427053 12.01383465 14.34377214 8.10350878 1.36429186 1.27979275 5.83680460 2.43897621 2.36651660 11.71724150 12.88663201 9.58696874 1.81689200 6.81458770 4.28318610 1.77497685 1.81821218 2.27844799 4.56189417 2.57615313 7.46593904 4.55959698 5.18361556 1.08866535 1.08737532 1.09157349 1.09524771
temp: 298.15 k
press: 1.00 atm
energy: -905.470015583463 hartree
zpe.correction: 0.105766845508 hartree
zpe.sumelectzpe: -905.364248737955 hartree
zpe.thermalcorrenthalpy: 0.118585823737 hartree
zpe.sumelectthermalent: -905.351429759726 hartree
symmnumber: 2 hartree.K-1
zpe.thermalcorrgfe: 0.066526945444 hartree
zpe.sumelectthermalfe: -905.403488638019 hartree
formula: C8H4F6
InChI: InChI=1/C8H4F6/c9-7(10,11)5-2-1-3-6(4-5)8(12,13)14/h1-4H
18 atoms
C  0.00491185 2.396865 -0.06710272
C  -1.21929168 1.73083744 -0.06416258
C  -1.21591955 0.27373168 -0.01223578
C  -0.00124555 -0.40703863 0.03182031
C  1.21647117 0.26980968 0.02840138
C  1.22611872 1.72687577 -0.02362423
H  0.0073291 3.49202915 -0.10507128
H  -2.1600714 2.28363853 -0.09809476
H  -0.00367499 -1.49863394 0.0696649
H  2.16926888 2.2766769 -0.0263832
C  2.49633761 -0.45320439 0.0749646
C  -2.49886003 -0.44535824 -0.01284222
F  2.36270368 -1.79151792 0.11791197
F  3.26710493 -0.12202076 1.1485761
F  3.30398328 -0.19432796 -0.99137655
F  -2.37113076 -1.78392516 0.03932807
F  -3.26398782 -0.18774213 -1.11047962
F  -3.30933542 -0.10816002 1.02901862
pointgroup: C2v
s2: 0.766462688764
