program: GRRM
programVersion: 23
method: UwB97XD
basis: Def2SVP scrf=(cpcm,solvent=acetonitrile)
charge: 0
multiplicity: 2
frequency: 12.33010684 87.89896702 116.90724179 132.56230661 155.80132004 225.26932910 249.48143681 297.66435349 337.37975954 364.58100415 415.63238318 448.82705177 516.93438493 523.15086540 598.81764271 599.20031445 638.13690448 668.07903019 698.17698780 749.46223777 799.06477686 862.38191438 899.36476012 907.96611723 989.77869649 1017.90724325 1093.16260353 1099.78113670 1126.24528589 1181.66768603 1189.40782568 1216.06913768 1304.38078911 1350.62763782 1359.36827091 1379.06097224 1450.89218787 1510.66795279 1587.87238618 1619.01919810 1658.41870549 3220.32825669 3232.98273340 3240.74754996 3251.81769852
redmass: 13.68412478 15.18316056 14.31044770 5.92127014 6.63303948 8.51395737 7.24007741 14.86653024 6.22289198 8.86657125 11.11413534 3.36491658 8.22703976 9.87509786 10.48277389 12.48809225 6.18111385 8.45815104 1.83350414 12.10143822 1.69156294 8.32513873 1.42960356 1.48098467 5.47242193 1.32747116 2.46421947 3.69516677 1.73087320 1.16059712 12.63392480 7.89522280 1.51811019 3.30769355 6.13597628 7.91142570 3.19677925 3.36180395 8.29258362 5.53325318 6.04364814 1.08856815 1.09354745 1.09866244 1.09279950
temp: 298.15 k
press: 1.00 atm
energy: -805.597994923244 hartree
zpe.correction: 0.105759247244 hartree
zpe.sumelectzpe: -805.492235676000 hartree
zpe.thermalcorrenthalpy: 0.117567182986 hartree
zpe.sumelectthermalent: -805.480427740258 hartree
symmnumber: 1 hartree.K-1
zpe.thermalcorrgfe: 0.067388552004 hartree
zpe.sumelectthermalfe: -805.530606371240 hartree
formula: C8H4F5
InChI: InChI=1/C8H4F5/c9-7(10)5-2-1-3-6(4-5)8(11,12)13/h1-4H
17 atoms
C  -0.01403596 2.33563083 -0.07988261
C  -1.20187918 1.62469121 -0.12378737
C  -1.18219973 0.20027639 -0.09645271
C  0.07428383 -0.46770337 -0.02329953
C  1.24153118 0.27186999 0.01926885
C  1.21698918 1.67662183 -0.00837532
H  -0.04102873 3.42660665 -0.1015233
H  -2.15592812 2.15028631 -0.17949899
H  0.10983251 -1.55652385 -0.00100093
H  2.14648675 2.24709675 0.02551432
C  2.57832932 -0.41953683 0.09825727
C  -2.36654912 -0.5328955 -0.1400509
F  2.47022999 -1.75045175 0.1147457
F  3.24892982 -0.06306057 1.20233093
F  3.3577345 -0.09830936 -0.94337173
F  -2.41685308 -1.84187532 -0.11880913
F  -3.55724016 0.0084696 -0.20620856
pointgroup: Cs
s2: 0.802418509307
