program: GRRM
programVersion: 23
method: UwB97XD
basis: Def2SVP scrf=(cpcm,solvent=acetonitrile)
charge: 0
multiplicity: 1
frequency: 44.53406870 51.99871692 91.19708035 189.81673333 206.96091139 235.66553373 709.45156390 713.00011304 883.09086699 1092.66739464 1439.98248585 1564.53987640
redmass: 16.68924426 17.34406727 27.02199894 26.55395668 19.73900332 18.54450673 15.66136515 15.65727732 12.63944926 15.92641765 12.91812714 12.85819464
temp: 298.15 k
press: 1.00 atm
energy: -1463.407503767627 hartree
zpe.correction: 0.016467440923 hartree
zpe.sumelectzpe: -1463.391036326704 hartree
zpe.thermalcorrenthalpy: 0.024604732600 hartree
zpe.sumelectthermalent: -1463.382899035028 hartree
symmnumber: 2 hartree.K-1
zpe.thermalcorrgfe: -0.017450743849 hartree
zpe.sumelectthermalfe: -1463.424954511476 hartree
formula: CO3K2
InChI: InChI=1/CO3.2K/c2-1(3)4;;/q-2;2*+1/rCK2O3/c4-1-2(4)6(1)3(1)5-1
6 atoms
C  0.000004 -0.832213 0.000002
O  0.000003 0.476839 0.000009
O  -1.117166 -1.458496 0.000028
O  1.117174 -1.458499 -0.00003
K  -2.59754 0.645117 -0.000007
K  2.597534 0.645121 0.000003
pointgroup: C2v
s2: -0.000000000000
