program: AMS
programVersion: 2021.106
runtype: GEOMETRY OPTIMIZATION
method: DFT
functional: PBE0 == Not Default ==
spinMolecule: Restricted
epsl: 37.50000
solvent: Acetonitrile angstrom
formula: O40PW12
InChI: InChI=1/O4P.36O.12W/c1-5(2,3)4;;;;;;;;;;;;;;;;;;;;;;;;;;;;;;;;;;;;;;;;;;;;;;;;/rO36W12.O4P/c1-37-13-38(2)17-39(3,14-37)20-43(7)22-41(5,16-37)18-40(4,15-37)21-42(6,19-38)27-44(8,23-38)31-45(9,24-39,29-43)34-48(12,33-44)35-46(10,25-40,28-42)32-47(11,26-41,30-43)36-48;1-5(2,3)4
53 atoms
P  0.000000 0.000000 0.000000
W  2.521865 2.521865 0.094936
W  -2.521865 2.521865 -0.094936
W  -2.521865 -2.521865 0.094936
W  2.521865 -2.521865 -0.094936
W  0.094936 2.521865 2.521865
W  -0.094936 -2.521865 2.521865
W  0.094936 -2.521865 -2.521865
W  -0.094936 2.521865 -2.521865
W  -2.521865 0.094936 -2.521865
W  2.521865 -0.094936 -2.521865
W  2.521865 0.094936 2.521865
W  -2.521865 -0.094936 2.521865
O  0.886849 0.886849 0.886849
O  -0.886849 0.886849 -0.886849
O  -0.886849 -0.886849 0.886849
O  0.886849 -0.886849 -0.886849
O  1.151465 1.151465 -2.981957
O  -1.151465 1.151465 2.981957
O  -1.151465 -1.151465 -2.981957
O  1.151465 -1.151465 2.981957
O  -2.981957 1.151465 1.151465
O  2.981957 -1.151465 1.151465
O  -2.981957 -1.151465 -1.151465
O  2.981957 1.151465 -1.151465
O  -1.151465 -2.981957 -1.151465
O  1.151465 2.981957 -1.151465
O  1.151465 -2.981957 1.151465
O  -1.151465 2.981957 1.151465
O  1.476244 1.476244 3.340845
O  -1.476244 1.476244 -3.340845
O  -1.476244 -1.476244 3.340845
O  1.476244 -1.476244 -3.340845
O  3.340845 1.476244 1.476244
O  -3.340845 -1.476244 1.476244
O  3.340845 -1.476244 -1.476244
O  -3.340845 1.476244 -1.476244
O  -1.476244 3.340845 -1.476244
O  1.476244 -3.340845 -1.476244
O  1.476244 3.340845 1.476244
O  -1.476244 -3.340845 1.476244
O  3.701967 3.701967 -0.193190
O  -3.701967 3.701967 0.193190
O  -3.701967 -3.701967 -0.193190
O  3.701967 -3.701967 0.193190
O  -0.193190 3.701967 3.701967
O  0.193190 -3.701967 3.701967
O  -0.193190 -3.701967 -3.701967
O  0.193190 3.701967 -3.701967
O  -3.701967 -0.193190 -3.701967
O  3.701967 0.193190 -3.701967
O  3.701967 -0.193190 3.701967
O  -3.701967 0.193190 3.701967
elementType: P W W W W W W W W W W W W O O O O O O O O O O O O O O O O O O O O O O O O O O O O O O O O O O O O O O O O
mdcq: 1.55099781 2.15660095 2.15660093 2.15660093 2.15660095 2.15660085 2.15660083 2.15660082 2.15660085 2.15660083 2.15660085 2.15660086 2.15660083 -0.84518846 -0.84518846 -0.84518845 -0.84518845 -0.81358756 -0.81358756 -0.81358756 -0.81358756 -0.81358719 -0.81358719 -0.81358719 -0.81358719 -0.81358719 -0.81358719 -0.81358719 -0.81358720 -0.81282395 -0.81282395 -0.81282396 -0.81282396 -0.81282402 -0.81282402 -0.81282402 -0.81282402 -0.81282402 -0.81282402 -0.81282402 -0.81282402 -0.62770981 -0.62770981 -0.62770981 -0.62770981 -0.62770993 -0.62770993 -0.62770993 -0.62770994 -0.62770993 -0.62770993 -0.62770993 -0.62770994
eener: -457.508459 electronvolt
kinener: 626.757887 electronvolt
coulombener: -189.410618 electronvolt
xcener: -570.362887 electronvolt
solvener: -10.224384 electronvolt
dispener: 0.000000 electronvolt
total: -600.748453 electronvolt
charge: 2.59173716 2.78844864 2.78844864 2.78844864 2.78844864 2.78844864 2.78844864 2.78844864 2.78844864 2.78844864 2.78844864 2.78844864 2.78844864 -1.08228340 -1.08228340 -1.08228340 -1.08228340 -1.05454571 -1.05454571 -1.05454571 -1.05454571 -1.05454571 -1.05454571 -1.05454571 -1.05454571 -1.05454571 -1.05454571 -1.05454571 -1.05454571 -1.05126826 -1.05126826 -1.05126826 -1.05126826 -1.05126826 -1.05126826 -1.05126826 -1.05126826 -1.05126826 -1.05126826 -1.05126826 -1.05126826 -0.78785163 -0.78785163 -0.78785163 -0.78785163 -0.78785163 -0.78785163 -0.78785163 -0.78785163 -0.78785163 -0.78785163 -0.78785163 -0.78785163
dipole: 0.00000000 -0.00000000 0.00000000
dipole: 0.000000
quadrupole: -0.00000000 -0.00000000 -0.00000000 0.00000000 0.00000000 -0.00000000
charge: -3
converged: GEOMETRY CONVERGED
mo.energy: -27.222 electronvolt
energy: -27.198 -27.198 -4.382 -27.198 4.723 -6.463 electronvolt
mo.energy: -27.074 electronvolt
energy: -27.198 -27.198 -4.382 4.723 electronvolt
mo.energy: -26.773 electronvolt
energy: -27.198 -27.198 -27.198 -6.463 0.094 -46.382 -4.382 electronvolt
mo.energy: -26.729 electronvolt
energy: -27.198 -27.198 -27.198 -27.198 -4.382 -27.198 -46.382 -6.463 0.094 electronvolt
mo.energy: -26.499 electronvolt
energy: -27.198 -27.198 -4.382 -4.382 electronvolt
mo.energy: -26.393 electronvolt
energy: -27.198 -4.382 -4.382 -46.382 -27.198 -6.463 electronvolt
mo.energy: -26.387 electronvolt
energy: -27.198 -27.198 -27.198 -4.382 -46.382 -4.382 electronvolt
mo.energy: -26.376 electronvolt
energy: -27.198 -27.198 -4.382 -27.198 -4.382 -27.198 -46.382 -4.382 electronvolt
mo.energy: -26.363 electronvolt
energy: -27.198 -4.382 -27.198 -27.198 -46.382 -4.382 -6.463 electronvolt
mo.energy: -26.354 electronvolt
energy: -27.198 -27.198 -27.198 -46.382 -4.382 0.094 electronvolt
mo.energy: -26.353 electronvolt
energy: -27.198 -27.198 -4.382 -4.382 -27.198 -27.198 -4.382 electronvolt
mo.energy: -26.224 electronvolt
energy: -27.198 -27.198 -27.198 -27.198 -4.382 electronvolt
mo.energy: -17.882 electronvolt
energy: -9.955 -27.198 3.817 -15.778 -4.382 -9.955 10.811 -4.382 electronvolt
mo.energy: -15.593 electronvolt
energy: -9.955 -5.658 -9.955 2.910 -4.382 -27.198 -4.382 -4.382 -4.382 -9.955 -9.955 electronvolt
mo.energy: -15.246 electronvolt
energy: -9.955 -4.382 -9.955 4.723 -4.382 electronvolt
mo.energy: -15.105 electronvolt
energy: -9.955 -9.955 -9.955 -9.955 -9.955 -4.382 -9.955 -4.382 -6.463 4.723 1.678 4.723 16.116 -4.382 -4.382 4.723 electronvolt
mo.energy: -14.367 electronvolt
energy: -9.955 -4.382 -9.955 -4.382 -9.955 -9.955 -9.955 -9.955 4.723 -4.382 4.723 electronvolt
mo.energy: -14.289 electronvolt
energy: -9.955 -9.955 -4.382 -9.955 -4.382 -9.955 -4.382 -9.955 -4.382 -9.955 4.723 0.094 -6.463 16.116 -9.955 electronvolt
mo.energy: -14.180 electronvolt
energy: -9.955 -9.955 -9.955 -9.955 -4.382 -4.382 -4.382 4.723 -9.955 -6.463 4.723 1.678 electronvolt
mo.energy: -14.030 electronvolt
energy: -4.382 -9.955 -9.955 -9.955 -4.382 -9.955 4.723 4.723 -4.382 electronvolt
mo.energy: -13.776 electronvolt
energy: -9.955 -4.382 -9.955 -9.955 -4.382 -9.955 -9.955 0.094 2.910 -9.955 11.981 -9.955 -4.382 -9.955 0.094 -5.658 -4.382 -27.198 -9.955 -9.955 -6.463 -9.955 electronvolt
mo.energy: -13.592 electronvolt
energy: -9.955 -9.955 -9.955 -4.382 -9.955 -9.955 -9.955 -9.955 -9.955 11.981 4.723 -4.382 -27.198 -9.955 -6.463 electronvolt
mo.energy: -13.417 electronvolt
energy: -9.955 -9.955 -4.382 -9.955 -9.955 -4.382 -4.382 -9.955 -4.382 4.723 -4.382 -9.955 -9.955 -9.955 -9.955 electronvolt
mo.energy: -13.161 electronvolt
energy: -4.382 -9.955 -9.955 -9.955 -4.382 -4.382 -9.955 4.723 -27.198 electronvolt
mo.energy: -12.831 electronvolt
energy: -9.955 -4.382 -4.382 -9.955 -9.955 -4.382 -9.955 -9.955 -9.955 -9.955 -4.382 -9.955 -9.955 -9.955 -9.955 4.723 electronvolt
mo.energy: -12.818 electronvolt
energy: -9.955 -9.955 -9.955 -4.382 -9.955 -9.955 -9.955 -4.382 -4.382 -4.382 -9.955 -9.955 -9.955 -27.198 -4.382 -9.955 electronvolt
mo.energy: -12.619 electronvolt
energy: -9.955 -9.955 -9.955 -4.382 -4.382 -4.382 -9.955 -4.382 -9.955 -9.955 -9.955 -9.955 -9.955 -9.955 -4.382 -9.955 -9.955 -9.955 electronvolt
mo.energy: -12.482 electronvolt
energy: -9.955 -9.955 -9.955 -4.382 -9.955 -9.955 -9.955 -4.382 -9.955 -9.955 -4.382 -4.382 -9.955 -4.382 -4.382 electronvolt
mo.energy: -12.191 electronvolt
energy: -9.955 -9.955 -9.955 -4.382 -9.955 -9.955 -9.955 -9.955 -4.382 -4.382 -4.382 -9.955 -4.382 4.723 electronvolt
mo.energy: -12.146 electronvolt
energy: -9.955 -9.955 -4.382 -9.955 -9.955 -9.955 -9.955 -9.955 -4.382 -9.955 -4.382 -4.382 0.094 -9.955 -4.382 -4.382 electronvolt
mo.energy: -12.020 electronvolt
energy: -9.955 -9.955 -9.955 -4.382 -9.955 -9.955 -9.955 -9.955 -4.382 4.723 -9.955 -4.382 -4.382 11.981 electronvolt
mo.energy: -12.018 electronvolt
energy: -9.955 -9.955 -9.955 -9.955 -9.955 -9.955 -9.955 -9.955 -4.382 -9.955 -4.382 -9.955 -4.382 -27.198 electronvolt
mo.energy: -11.911 electronvolt
energy: -9.955 -9.955 -9.955 -9.955 -9.955 -4.382 -9.955 -9.955 -4.382 -9.955 -6.463 -4.382 -4.382 electronvolt
mo.energy: -11.799 electronvolt
energy: -9.955 -9.955 -4.382 -4.382 -27.198 -27.198 -9.955 -9.955 0.094 -9.955 -4.382 -9.955 electronvolt
mo.energy: -11.681 electronvolt
energy: -9.955 -4.382 -9.955 -9.955 -9.955 -9.955 -9.955 -9.955 -9.955 -4.382 -9.955 electronvolt
mo.energy: -11.633 electronvolt
energy: -9.955 -4.382 -9.955 -9.955 -9.955 -9.955 -4.382 -27.198 -9.955 -4.382 electronvolt
mo.energy: -11.627 electronvolt
energy: -9.955 -9.955 -4.382 -4.382 -9.955 -9.955 -4.382 -9.955 -9.955 -9.955 -27.198 -4.382 -9.955 -9.955 -9.955 -4.382 4.723 -9.955 electronvolt
mo.energy: -11.440 electronvolt
energy: -9.955 -4.382 -9.955 -9.955 -27.198 -9.955 4.723 -9.955 -27.198 -9.955 electronvolt
mo.energy: -11.352 electronvolt
energy: -9.955 -4.382 -9.955 -9.955 -4.382 4.723 10.811 10.811 electronvolt
mo.energy: -11.332 electronvolt
energy: -9.955 -9.955 -9.955 -9.955 -4.382 -4.382 -4.382 -9.955 -9.955 -9.955 -9.955 -9.955 -4.382 electronvolt
mo.energy: -11.195 electronvolt
energy: -9.955 -9.955 -9.955 -9.955 -9.955 -4.382 -9.955 -4.382 -9.955 0.094 electronvolt
mo.energy: -10.998 electronvolt
energy: -9.955 -9.955 -9.955 -4.382 -9.955 -9.955 -9.955 -9.955 11.981 -27.198 -6.463 electronvolt
mo.energy: -10.883 electronvolt
energy: -9.955 -9.955 -9.955 -9.955 -9.955 11.981 -9.955 -9.955 -27.198 -4.382 -4.382 -9.955 electronvolt
mo.energy: -10.820 electronvolt
energy: -9.955 -9.955 -9.955 -9.955 -9.955 -9.955 -9.955 -9.955 -4.382 -9.955 electronvolt
mo.energy: -10.739 electronvolt
energy: -9.955 -9.955 -9.955 0.094 -46.382 35.299 -4.382 electronvolt
mo.energy: -10.662 electronvolt
energy: -9.955 -9.955 -9.955 -9.955 4.723 -9.955 0.094 electronvolt
mo.energy: -10.429 electronvolt
energy: -9.955 -9.955 -9.955 -9.955 -9.955 0.094 electronvolt
mo.energy: -10.325 electronvolt
energy: -9.955 -4.382 -9.955 -9.955 -9.955 -9.955 -4.382 -9.955 -9.955 -9.955 electronvolt
mo.energy: -10.152 electronvolt
energy: -9.955 -9.955 -9.955 -9.955 -9.955 -9.955 10.811 electronvolt
mo.energy: -9.906 electronvolt
energy: -9.955 -9.955 -9.955 -9.955 -9.955 -9.955 -9.955 -9.955 -9.955 -9.955 -9.955 -9.955 electronvolt
mo.energy: -9.770 electronvolt
energy: -9.955 -9.955 -9.955 -9.955 -9.955 -9.955 -9.955 -9.955 -9.955 0.094 -9.955 -9.955 electronvolt
mo.energy: -9.466 electronvolt
energy: -9.955 -9.955 -9.955 -9.955 -9.955 -9.955 -9.955 -9.955 -9.955 electronvolt
mo.energy: -9.449 electronvolt
energy: -9.955 -9.955 -9.955 -9.955 -9.955 -9.955 -9.955 electronvolt
mo.energy: -9.310 electronvolt
energy: -9.955 -9.955 -9.955 -9.955 -9.955 -9.955 -9.955 -9.955 -9.955 -9.955 -9.955 0.094 electronvolt
mo.energy: -9.244 electronvolt
energy: -9.955 -9.955 -9.955 -9.955 -9.955 -9.955 -9.955 -9.955 -9.955 10.811 electronvolt
mo.energy: -9.193 electronvolt
energy: -9.955 -9.955 -9.955 -9.955 -9.955 -9.955 -9.955 -9.955 electronvolt
energy: -9.955 -9.955 -9.955 -9.955 -9.955 -9.955 electronvolt
mo.energy: -9.182 electronvolt
mo.energy: -9.149 electronvolt
energy: -9.955 -9.955 -9.955 -9.955 -9.955 electronvolt
mo.energy: -8.840 electronvolt
energy: -9.955 -9.955 -9.955 -9.955 -9.955 -4.382 electronvolt
mo.energy: -8.778 electronvolt
energy: -9.955 -9.955 -9.955 -9.955 -9.955 -9.955 10.811 -9.955 10.811 0.094 -9.955 electronvolt
mo.energy: -8.460 electronvolt
energy: -9.955 -9.955 -9.955 -9.955 10.811 10.811 electronvolt
mo.energy: -3.601 electronvolt
energy: -4.382 -4.382 -9.955 -9.955 -9.955 -4.382 -9.955 0.094 4.723 30.706 electronvolt
mo.energy: -3.200 electronvolt
energy: -4.382 -4.382 -9.955 -9.955 -9.955 -9.955 -9.955 -9.955 -4.382 4.723 electronvolt
mo.energy: -2.325 electronvolt
energy: -4.382 -4.382 -9.955 -9.955 -9.955 -4.382 -9.955 -9.955 -9.955 4.723 4.723 electronvolt
mo.energy: -2.212 electronvolt
energy: -4.382 -9.955 -4.382 -9.955 4.723 10.811 -9.955 electronvolt
mo.energy: -2.197 electronvolt
energy: -4.382 -9.955 -4.382 -4.382 -9.955 -4.382 -4.382 -9.955 -4.382 10.811 -9.955 electronvolt
mo.energy: -1.937 electronvolt
energy: -4.382 -4.382 -9.955 -9.955 -4.382 -4.382 -4.382 -9.955 -4.382 4.723 -9.955 -9.955 0.094 electronvolt
mo.energy: -1.764 electronvolt
energy: -4.382 -9.955 -9.955 4.723 -9.955 -4.382 -9.955 -9.955 -9.955 -4.382 electronvolt
mo.energy: -1.621 electronvolt
energy: -4.382 -9.955 -4.382 -9.955 4.723 -9.955 -4.382 -9.955 10.811 electronvolt
mo.energy: -1.476 electronvolt
energy: -4.382 -4.382 -9.955 -9.955 -9.955 -9.955 -4.382 -9.955 4.723 -9.955 4.723 -9.955 -4.382 -9.955 -9.955 0.094 -4.382 electronvolt
mo.energy: -1.012 electronvolt
energy: -4.382 -4.382 -4.382 -9.955 -9.955 -9.955 -9.955 0.094 -9.955 -15.778 4.723 4.723 1.678 -27.198 10.811 23.286 4.723 electronvolt
mo.energy: -0.924 electronvolt
energy: -4.382 -9.955 4.723 -9.955 -9.955 -9.955 -9.955 0.094 electronvolt
mo.energy: -0.816 electronvolt
energy: -4.382 -9.955 -4.382 -4.382 -9.955 -4.382 4.723 -4.382 -9.955 -9.955 -4.382 -9.955 -9.955 0.094 -6.463 electronvolt
mo.energy: -0.696 electronvolt
energy: -4.382 -4.382 -9.955 -4.382 -9.955 -9.955 -9.955 4.723 4.723 -9.955 -9.955 -4.382 electronvolt
mo.energy: -0.575 electronvolt
energy: -4.382 -4.382 -4.382 -9.955 -9.955 -9.955 4.723 -9.955 -9.955 -9.955 -9.955 -9.955 4.723 -9.955 -27.198 4.723 electronvolt
mo.energy: -0.198 electronvolt
energy: -4.382 -4.382 -9.955 -9.955 -9.955 -4.382 4.723 4.723 -9.955 -9.955 -9.955 -15.778 electronvolt
mo.energy: 0.364 electronvolt
energy: 1.678 -4.382 -6.463 -4.382 23.286 -9.955 -9.955 -27.198 -9.955 23.286 -9.955 3.817 -27.198 -4.382 -9.955 10.811 0.094 23.286 10.811 electronvolt
mo.energy: 0.603 electronvolt
energy: -4.382 -4.382 -4.382 -4.382 -4.382 0.094 -9.955 -9.955 -9.955 -9.955 -27.198 -9.955 -9.955 -9.955 -9.955 -9.955 4.723 4.723 electronvolt
mo.energy: 0.647 electronvolt
energy: 1.678 -4.382 0.094 -4.382 -6.463 -9.955 -9.955 4.723 -27.198 -9.955 23.286 -15.778 -9.955 10.811 -27.198 16.116 electronvolt
mo.energy: 1.018 electronvolt
energy: 1.678 -6.463 2.910 0.094 0.094 -5.658 23.286 4.723 -4.382 16.116 -4.382 4.723 -27.198 10.811 -4.382 electronvolt
mo.energy: 1.318 electronvolt
energy: -4.382 -4.382 -4.382 0.094 -9.955 -9.955 -9.955 -27.198 -27.198 -9.955 -9.955 -9.955 -6.463 23.286 0.094 -9.955 10.811 -9.955 electronvolt
mo.energy: 1.355 electronvolt
energy: -4.382 -6.463 -4.382 -4.382 1.678 -9.955 -9.955 0.094 0.094 -9.955 -4.382 -4.382 -5.658 -27.198 23.286 -27.198 -9.955 -4.382 -9.955 -6.463 -4.382 10.811 10.811 10.811 electronvolt
mo.energy: 1.477 electronvolt
energy: 1.678 -6.463 -4.382 -4.382 0.094 -4.382 0.094 -9.955 0.094 -4.382 23.286 -9.955 -9.955 4.723 1.678 -4.382 -4.382 -9.955 -27.198 electronvolt
mo.energy: 1.487 electronvolt
energy: -4.382 -9.955 -9.955 -27.198 -27.198 1.678 10.811 -4.382 -4.382 -6.463 0.094 23.286 4.723 0.094 -9.955 23.286 -9.955 30.706 electronvolt
mo.energy: 1.728 electronvolt
energy: -6.463 1.678 0.094 -4.382 4.723 0.094 -4.382 10.811 -9.955 23.286 -4.382 -27.198 10.811 10.811 electronvolt
