program: Gaussian 16
title: CO2 addition to 5, IS1
version: ES64L-G16RevB.01
method: RPBE1PBE
basis: Gen
operation: SP
keyword: #p
keyword: PBE1PBE/gen
keyword: pseudo=read
keyword: geom=allCheck
keyword: guess=read
keyword: scrf=(smd,solvent=Dichloromethane)
keyword: int=ultrafine
keyword: nosymm
keyword: EmpiricalDispersion=GD3
keyword: GFInput
title: #p PBE1PBE/gen pseudo=read geom=allCheck guess=read scrf=(smd,solvent=
basis: NPDir=0 NMtPBC= 1 NCelOv= 1 NCel= 1 NClECP= 1 NCelD= 1
basis: NCelK= 1 NCelE2= 1 NClLst= 1 CellRange= 0.0.
basis: One-electron integrals computed using PRISM.
title: Mulliken charges:
elementType: Hf O N C O N C H H O C H H C Cl C C C H C C H C C H H H C H H H C H H H C C H H H C H H H C H H H C C C C H C C H C C H H H C H H H C H H H C C H H H C H H H C H H H H Cl C H C H C H H C H H C H H C H C O O Cl O C H C H C H H C H H C H H C H H
charge: 0.218012 0.042823 0.828770 -1.801520 0.123674 0.689106 -0.610866 0.301935 0.325505 0.242308 -0.515507 0.307700 0.311073 0.360277 -0.717833 0.097364 0.579074 -0.918774 0.278366 0.423539 -0.726821 0.308507 0.689085 -1.180102 0.302570 0.302694 0.302662 -1.171466 0.282313 0.279546 0.284604 -1.180835 0.282769 0.282794 0.283128 0.499805 -1.199146 0.269893 0.263401 0.400215 -1.431066 0.277395 0.364313 0.277817 -0.918501 0.312399 0.307875 0.306804 0.303843 -0.177569 0.081852 -1.021230 0.284402 1.068189 -0.740902 0.320109 0.679592 -1.145663 0.276106 0.271694 0.354118 -1.279389 0.275856 0.348848 0.282592 -0.770223 0.309617 0.303733 0.309633 0.310146 -1.209098 0.284950 0.281202 0.285610 -1.027806 0.287267 0.279529 0.287327 -1.148207 0.300767 0.312161 0.303977 0.310908 -0.414695 0.165638 0.331575 -1.272516 0.305499 -0.350368 0.267185 0.292369 -1.209344 0.284458 0.295525 -0.644031 0.289392 0.358625 0.701369 0.363852 -0.590682 -0.106586 -0.098667 -0.445399 0.193563 0.355789 0.303813 0.406606 0.359606 -0.436796 0.397815 0.273993 -1.349694 0.287043 0.289683 -0.186811 0.250674 0.413351 -1.546318 0.337105 0.295763
chargesum: -1.00000
dipole: 16.9983 -13.2276 -10.3164
dipole: 23.8818
quadrupole: -418.5439 -483.9487 -390.4749
quadrupole: 36.4106 1.5760 -24.8019
quadrupole: 12.4453 -52.9595 40.5143 36.4106 1.5760 -24.8019
hfenergy: -3703.7021715 hartree
pointgroup: C01 [X(C44H64Cl3Hf1N2O6)]
dipole: 4.4030522 -1.3967811 -4.6385061 debye
InChI: InChI=1/44C.3Cl.Hf.2N.6O.64H
charge -1 multiplicity 1
120 atoms
Hf -1.828936 1.836546 -0.008199
O  -2.859032 2.391912 -1.637282
N  -0.601764 1.400796 -3.007287
C  -0.320972 1.457293 -1.696378
O  -0.285846 0.986876 0.980844
N  0.996126 1.266665 -1.521807
C  1.712501 1.194612 -2.802935
H  2.411759 0.355118 -2.809468
H  2.267277 2.125904 -2.968153
O  -3.241699 2.072732 1.737874
C  0.578618 1.027347 -3.801689
H  0.685766 1.683254 -4.668672
H  0.477888 -0.008891 -4.144685
C  -1.871694 1.514111 -3.614443
Cl -2.607922 -0.53292 -0.599777
C  -2.982718 2.028735 -2.904036
C  -4.227453 2.159532 -3.57129
C  -4.307503 1.763728 -4.90668
H  -5.25872 1.858485 -5.41851
C  -3.221719 1.24386 -5.623743
C  -2.007274 1.129564 -4.954769
H  -1.147876 0.72518 -5.47446
C  -3.402837 0.821667 -7.084378
C  -2.106549 0.292916 -7.704167
H  -2.288731 0.007886 -8.747707
H  -1.734685 -0.596015 -7.179567
H  -1.313275 1.051094 -7.702592
C  -3.87186 2.027119 -7.91549
H  -4.007956 1.73676 -8.96578
H  -3.134442 2.838877 -7.879266
H  -4.827036 2.424402 -7.553268
C  -4.461548 -0.290041 -7.168756
H  -4.605724 -0.602264 -8.211724
H  -5.431611 0.043578 -6.782572
H  -4.153131 -1.168835 -6.588875
C  -5.447624 2.727479 -2.833003
C  -5.146211 4.153548 -2.340446
H  -6.031815 4.571228 -1.842822
H  -4.893738 4.808236 -3.185193
H  -4.3215 4.164881 -1.624597
C  -5.813723 1.829525 -1.638243
H  -6.686968 2.241521 -1.115131
H  -4.993431 1.754996 -0.922689
H  -6.066643 0.816519 -1.976642
C  -6.682585 2.8061 -3.737996
H  -7.51957 3.220752 -3.162731
H  -6.993184 1.819618 -4.104656
H  -6.521655 3.461687 -4.603217
C  1.700398 1.292834 -0.298254
C  1.032392 1.124291 0.939552
C  1.802022 1.112879 2.132616
C  3.179728 1.30802 2.037825
H  3.76371 1.314862 2.951339
C  3.850324 1.511324 0.824918
C  3.086709 1.488934 -0.337088
H  3.566291 1.642698 -1.295667
C  1.120459 0.93914 3.495211
C  0.313451 -0.369338 3.529546
H  -0.169841 -0.485194 4.508016
H  0.97328 -1.233197 3.374341
H  -0.459746 -0.387971 2.759162
C  0.201269 2.143109 3.760223
H  -0.327273 2.013939 4.714282
H  -0.543641 2.275048 2.974001
H  0.790257 3.066996 3.82606
C  2.130675 0.87464 4.646714
H  1.586929 0.73183 5.588792
H  2.712946 1.799276 4.743298
H  2.829452 0.035404 4.537573
C  5.360147 1.76252 0.818399
C  6.088149 0.556679 1.433893
H  7.172848 0.727678 1.440048
H  5.890047 -0.356037 0.85798
H  5.772958 0.376791 2.468224
C  5.671327 3.017414 1.650806
H  6.751905 3.212743 1.657971
H  5.344943 2.906152 2.691184
H  5.168257 3.898889 1.233888
C  5.907637 1.98165 -0.59436
H  6.98872 2.16105 -0.545433
H  5.449951 2.853273 -1.07903
H  5.746991 1.106475 -1.236437
H  -4.706854 2.947154 3.840646
Cl -3.530077 -1.065775 4.184948
C  -3.512513 1.372082 2.970719
H  -2.658938 1.527054 3.638248
C  -4.794768 1.877004 3.634172
H  -4.86455 1.382242 4.612408
C  -6.047448 1.570924 2.818341
H  -6.930839 1.951884 3.346657
H  -5.995697 2.100176 1.857147
C  -6.174186 0.070604 2.571246
H  -7.047002 -0.147292 1.942773
H  -6.330369 -0.449231 3.527409
C  -4.918874 -0.458179 1.887687
H  -4.965751 -1.5413 1.726305
H  -4.827695 0.000745 0.895798
C  -3.635541 -0.115709 2.626637
H  -2.764954 -0.447873 2.059001
C  -3.349773 3.682154 1.942319
O  -2.767559 4.047751 2.943729
O  -3.996959 4.145337 1.023626
Cl 0.008805 7.147844 1.64963
O  -1.098664 3.601973 0.296014
C  -0.936868 4.983515 0.247915
H  -1.901238 5.457787 0.476465
C  0.066999 5.341341 1.354427
H  -0.280162 4.902067 2.291568
C  1.483353 4.905794 1.02189
H  1.47497 3.807636 1.040232
H  2.171396 5.232094 1.810903
C  1.941335 5.381905 -0.354553
H  2.031611 6.477692 -0.356658
H  2.941055 4.979634 -0.563548
C  0.955467 4.945561 -1.437724
H  1.275184 5.318293 -2.419907
H  0.951614 3.850233 -1.496636
C  -0.45844 5.43435 -1.131526
H  -1.173506 5.063351 -1.876029
H  -0.490011 6.531985 -1.168924
