program: Gaussian 16
title: TS 3prime-CHO-trans-Cl2 to 4
version: ES64L-G16RevB.01
method: RPBE1PBE
basis: Gen
operation: Freq
keyword: #P
keyword: Geom=AllCheck
keyword: Guess=TCheck
keyword: SCRF=Check
keyword: GenChk
keyword: RPBE1PBE/ChkBas
keyword: Freq
converged: YES YES NO NO
title: Mulliken charges:
elementType: Hf O N C Cl O N C H H Cl C H H C C C C H C C H C C H H H C H H H C H H H C C H H H C H H H C H H H C C C C H C C H C C H H H C H H H C H H H C C H H H C H H H C H H H O H C H C H C H H C H H C H H C H Cl
charge: -0.528157 -0.426475 0.185397 0.150927 -0.261357 -0.336016 0.158033 -0.463570 0.284696 0.282364 -0.265601 -0.495063 0.283649 0.283234 0.103306 0.370389 0.006647 -0.543556 0.229547 -0.443807 -0.389690 0.241629 0.391314 -0.864208 0.234348 0.272607 0.241020 -0.878214 0.233602 0.241857 0.271915 -0.637657 0.249486 0.250430 0.250630 0.558555 -0.693480 0.246072 0.249077 0.249254 -0.766759 0.238623 0.244869 0.246756 -0.771987 0.238701 0.247190 0.244726 0.239419 0.303653 -0.192270 -0.621188 0.228362 -0.082706 -0.386812 0.242629 0.113598 -0.512824 0.252881 0.249311 0.250958 -0.850334 0.240298 0.271748 0.240264 -0.803555 0.243994 0.242367 0.269482 0.356153 -0.763294 0.238200 0.241094 0.247731 -0.751239 0.238805 0.247120 0.239703 -0.697903 0.243562 0.251916 0.251746 -0.324062 0.279087 0.035294 0.332458 -0.666873 0.291210 -0.358706 0.234218 0.256892 -0.683537 0.231331 0.257240 -0.628314 0.252072 0.255959 0.215142 0.263193 -0.740728
chargesum: -1.00000
title: Mulliken charges with hydrogens summed into heavy atoms:
elementType: Hf O N C Cl O N C Cl C C C C C C C C C C C C C C C C C C C C C C C C C C C C C O C C C C C C Cl
charge: -0.528157 -0.426475 0.185397 0.150927 -0.261357 -0.336016 0.158033 0.103491 -0.265601 0.071820 0.103306 0.370389 0.006647 -0.314009 -0.443807 -0.148061 0.391314 -0.116233 -0.130840 0.112888 0.558555 0.050923 -0.036511 -0.041370 0.239419 0.303653 -0.192270 -0.392826 -0.082706 -0.144183 0.113598 0.240326 -0.098023 -0.047711 0.356153 -0.036269 -0.025611 0.049322 -0.324062 0.367751 -0.096576 0.132404 -0.194965 -0.120283 0.478335 -0.740728
chargesum: -1.00004
polarizability: 9.50295537e+02 8.14584538e+01 6.36515403e+02 5.37603687e+01 -9.13114793e+01 7.95618966e+02
1716.lowfreq: -425.2309 -0.0255 -0.0030 -0.0019 0.1111 3.8707 5.5805 10.2803 14.0738
redmass: 9.3445 6.7444 4.9838 4.4225 7.2640 4.3821 3.7379 3.0589 3.5361 6.9591 5.3988 8.3541 4.7494 3.3248 3.7606 3.2108 9.7244 3.6786 12.0054 3.5433 5.8505 5.1715 4.3524 3.9292 2.2174 3.9048 4.2964 3.5961 2.7777 4.1754 4.5229 4.3750 5.6102 4.4136 3.6626 1.2669 1.3125 1.8007 4.2309 1.7458 1.6772 1.9116 2.6707 1.9203 4.2994 1.6886 1.6095 1.8327 2.9422 1.5379 1.7955 1.4284 1.6404 3.4222 2.8600 3.0701 2.7590 2.5959 2.7338 3.1493 2.2883 1.1434 1.2497 1.0859 1.3877 1.9163 2.7679 2.9470 2.4622 2.4370 3.6598 3.3025 2.5870 2.6132 4.2322 2.3350 4.7423 4.3400 4.5144 3.4214 3.3537 3.1163 5.4773 3.5621 6.2703 3.3310 3.0275 3.0739 3.4933 4.7252 4.7030 3.2771 3.2078 5.8249 5.2719 1.9770 6.1824 7.2993 4.8894 4.7613 5.7701 5.7537 1.4489 3.4600 2.8781 2.6564 1.5290 1.5597 4.1392 2.4305 1.8046 3.8702 1.4629 1.4445 2.0016 1.3410 2.7824 3.3925 1.6460 1.6497 1.6498 1.6406 1.6833 1.6502 1.6560 1.6156 1.2003 1.2017 1.4201 1.2012 2.2548 6.4945 2.1556 1.5626 1.9529 1.4581 1.4591 1.3963 1.3906 1.3923 1.3819 1.3861 1.3824 1.6192 1.6482 2.6889 3.5886 1.5834 2.5592 1.6646 1.1269 2.0379 2.0321 1.3661 1.5381 2.5491 2.5141 2.8633 2.8682 2.8067 2.8685 1.2666 2.5343 2.7832 2.8594 2.6213 1.3246 2.3496 1.2320 2.2290 1.4829 1.2945 1.1843 2.0152 2.4507 4.4610 4.9962 2.3187 1.2872 4.7564 2.5044 2.6251 1.7760 1.5636 6.1889 1.2376 1.2421 1.5075 1.2949 1.2800 1.2798 1.3209 1.2673 1.2884 1.6138 1.2404 1.2557 1.2310 1.2406 1.2565 2.7666 2.8644 1.3054 1.0797 1.3333 1.1819 1.0453 1.0456 1.0478 1.2067 1.0513 1.1742 1.1129 1.1676 1.1241 1.1071 1.0809 1.0656 1.2050 1.2805 1.1011 1.0851 1.0831 1.0563 1.0554 2.2798 1.0518 1.0609 1.0863 1.1046 1.6293 1.1912 1.1191 1.1282 2.3577 3.4629 7.5921 7.6045 5.5334 5.6710 1.0357 1.0359 1.0372 1.0368 1.0361 1.0358 1.0393 1.0385 1.0371 1.0370 1.0396 1.0397 1.0613 1.0657 1.0621 1.0638 1.0589 1.0615 1.0989 1.1022 1.1022 1.1021 1.1020 1.1021 1.1021 1.1022 1.1019 1.1019 1.1025 1.1023 1.1011 1.1026 1.1027 1.1013 1.1010 1.1011 1.1032 1.1009 1.1020 1.1016 1.1023 1.1016 1.1095 1.0896 1.1093 1.0978 1.0979 1.0969 1.0965 1.0884 1.0892 1.0883 1.0889 1.0930
irintensity: 1805.6221 2.2085 0.1603 0.2218 2.8664 2.2445 0.0131 0.1301 0.1771 0.5618 2.0127 5.2318 4.2602 0.4591 5.5915 3.5187 9.5222 0.6041 17.3424 3.7250 4.8251 3.5646 1.7383 0.6905 0.2209 1.3106 6.7469 0.8101 0.4977 5.5976 10.9865 15.8148 28.3372 42.2833 5.9597 19.0333 22.1655 63.9240 61.4065 24.6146 28.4330 2.8309 3.9475 8.5018 23.5184 0.9846 0.5706 3.0311 1.0326 3.0087 9.1913 1.0699 0.6073 5.4050 2.0731 1.4271 0.3846 2.5917 16.4420 12.6381 0.1237 0.0260 0.7083 0.1223 2.0898 3.5815 0.8983 4.0809 0.5810 0.2434 32.1140 46.0149 4.9848 0.3369 96.2393 2.6627 145.7000 1.1177 5.3492 0.7963 9.7678 9.0566 16.7188 49.8494 0.1822 13.7087 6.1259 88.4298 2.2933 0.3448 1.3469 13.3373 10.4223 0.7184 78.1455 58.2219 107.4232 0.1623 54.7854 14.2688 25.5858 2.8821 40.2260 11.9573 1.6913 0.4188 47.2539 6.7299 192.8138 85.4315 32.7663 78.7394 16.9959 20.1948 18.4567 6.9405 17.2188 1.1286 1.9448 2.3949 2.0296 2.2357 11.3720 3.0610 1.4474 3.9676 0.1315 0.2529 1.8890 0.5040 6.9882 80.0798 72.4557 7.1573 392.9454 4.3172 3.9679 1.3948 3.4074 0.0391 0.2258 0.1245 0.1890 57.3167 81.0523 0.6566 67.1935 4.4364 6.8257 0.2030 10.6283 9.7678 3.4387 149.4978 21.0897 17.7600 4.4910 4.8889 6.3949 8.8828 0.7805 31.3067 16.8190 4.7111 48.4088 14.7061 3.2045 69.7162 6.0130 170.9969 47.7091 29.6208 8.6563 2.3706 5.0518 23.7935 36.9729 75.5087 0.8105 13.8092 931.5723 231.3925 3.0942 13.7456 120.7427 12.3713 14.5880 1.7848 0.8700 20.4445 13.2173 7.0976 9.8873 18.5213 6.8782 2.5725 9.2743 4.7293 10.0420 37.3910 36.0107 52.8463 22.9320 3.2352 19.1215 8.1758 0.5162 0.4894 0.7321 3.0113 4.2925 90.8533 7.9908 0.9172 44.0173 7.3832 37.8398 25.0990 272.3792 223.9906 43.6378 17.3643 6.6069 11.4818 14.6721 11.6191 8.4661 14.0713 11.5090 7.0255 560.2902 211.1311 53.4057 17.3626 982.9788 277.9559 9.3436 9.0835 6.2239 1.9521 51.0812 49.7650 44.5045 51.3000 37.3803 51.6749 64.3074 64.9422 57.9835 79.5298 56.1747 68.2219 44.1523 25.7687 41.6097 21.2224 41.8695 40.8208 53.4878 20.6619 31.5296 44.5092 33.6857 32.8239 10.0301 9.6119 48.6648 39.3030 27.1393 54.9854 107.3607 44.2247 54.2054 147.3191 143.5546 71.4174 19.7759 45.3828 43.0378 82.2201 18.9636 73.2932 1.2030 25.9543 17.2794 14.7529 13.7973 24.4432 17.1511 10.9543 4.5012 3.6596 2.0067 6.9573
temp: 298.150 k
press: 1.00000 atm
elementType: 72 8 7 6 17 8 7 6 1 1 17 6 1 1 6 6 6 6 1 6 6 1 6 6 1 1 1 6 1 1 1 6 1 1 1 6 6 1 1 1 6 1 1 1 6 1 1 1 6 6 6 6 1 6 6 1 6 6 1 1 1 6 1 1 1 6 1 1 1 6 6 1 1 1 6 1 1 1 6 1 1 1 8 1 6 1 6 1 6 1 1 6 1 1 6 1 1 6 1 17
symmnumber: 1
zpe: 2246434.7 jmol-1
zpe.correction: 0.855622 hartree
zpe.thermalcorrener: 0.906760 hartree
zpe.thermalcorrenthalpy: 0.907705 hartree
zpe.thermalcorrgfe: 0.768559 hartree
zpe.sumelectzpe: -3204.331876 hartree
zpe.sumelectthermal: -3204.280737 hartree
zpe.sumelectthermalent: -3204.279793 hartree
zpe.sumelectthermalfe: -3204.418938 hartree
dipole: 24.8041 3.2230 -14.1826
dipole: 28.7537
quadrupole: -462.6440 -341.4694 -329.8295
quadrupole: -7.6373 73.4791 -20.7680
quadrupole: -84.6630 36.5116 48.1515 -7.6373 73.4791 -20.7680
hfenergy: -3205.1874976 hartree
pointgroup: C01 [X(C37H54Cl3Hf1N2O3)]
dipole: 5.6887564 4.1522844 -6.8706702 debye
polarizability: 950.2955371|81.4584538|636.5154032|53.7603687|-91.3114793|795.6189656 unknown
InChI: InChI=1/37C.3Cl.Hf.2N.3O.54H
charge -1 multiplicity 1
100 atoms
Hf -2.32176787 1.18050042 -0.02168994
O  -0.47039614 1.69540424 0.45009304
N  -0.37609714 2.75443791 -2.17638108
C  -1.61322152 2.27399302 -1.95755606
Cl -3.18473007 3.3846524 0.81691595
O  -3.90729458 1.01649884 -1.19246162
N  -2.38001406 2.53681 -3.03113059
C  -1.65524812 3.2936283 -4.06334555
H  -2.10789826 4.2829425 -4.18320517
H  -1.69661343 2.76457871 -5.01908926
Cl -1.50704431 -1.05118401 -0.78681287
C  -0.24374666 3.36982055 -3.50639951
H  0.47119259 2.80114621 -4.10911608
H  0.10957644 4.39998671 -3.41200232
C  0.74997409 2.69788308 -1.32415413
C  0.67325286 2.1724103 -0.01377113
C  1.82970047 2.15502217 0.80560684
C  3.01757108 2.65935394 0.27966771
H  3.90643363 2.64811781 0.90023673
C  3.12171856 3.17945564 -1.0174147
C  1.97389223 3.18985268 -1.80252004
H  2.02752054 3.58458788 -2.80822964
C  1.76106658 1.58719017 2.22996841
C  0.74656087 2.38186062 3.07115181
H  0.70504458 1.97265648 4.08943187
H  -0.25770419 2.33970489 2.64363516
H  1.04507736 3.43572381 3.14311217
C  1.36061445 0.10191835 2.187435
H  1.31927987 -0.3024355 3.20763212
H  2.09899388 -0.48158362 1.62253422
H  0.38374188 -0.04405317 1.72129864
C  3.11293138 1.6733414 2.94795208
H  3.00669428 1.25934818 3.9582027
H  3.46209655 2.7082997 3.05172895
H  3.89209249 1.09470079 2.43633017
C  4.4681104 3.70851786 -1.51945775
C  4.39169158 4.23509127 -2.95500449
H  5.37880964 4.60048145 -3.26373659
H  3.6868766 5.07088001 -3.04791095
H  4.0938 3.45187637 -3.66332855
C  4.93731824 4.85818783 -0.61286692
H  5.90464623 5.24561587 -0.9590886
H  5.06114637 4.53240591 0.42632199
H  4.21574384 5.68464634 -0.6230817
C  5.50962672 2.57828649 -1.47960187
H  6.48278468 2.94427752 -1.83273532
H  5.20588551 1.74281073 -2.12262852
H  5.64789801 2.18846822 -0.46459306
C  -3.74138277 2.21935081 -3.23521966
C  -4.48112152 1.44788524 -2.30409034
C  -5.83582244 1.14259376 -2.56612038
C  -6.40851697 1.62169214 -3.74849502
H  -7.44653652 1.38911141 -3.94684543
C  -5.70278013 2.38809855 -4.67927848
C  -4.36623038 2.6745678 -4.40027156
H  -3.80200123 3.26936897 -5.10885999
C  -6.64849013 0.31053623 -1.56425546
C  -8.09008222 0.08665392 -2.03557821
H  -8.61987715 -0.5138146 -1.28600854
H  -8.1359722 -0.45857879 -2.98667091
H  -8.64025721 1.02895836 -2.14999749
C  -6.00810125 -1.07748752 -1.38635806
H  -6.58334774 -1.66426538 -0.65791217
H  -4.9762272 -1.0076713 -1.03460717
H  -6.00767883 -1.62646362 -2.33704226
C  -6.72162794 1.03825075 -0.21011145
H  -7.30218584 0.44229558 0.50600048
H  -7.21794878 2.01082699 -0.3214782
H  -5.73026806 1.21237571 0.21402026
C  -6.33443451 2.92049071 -5.96932633
C  -6.28585277 4.4572441 -5.96869699
H  -6.73549728 4.85374374 -6.88869166
H  -5.25719588 4.83214225 -5.9116413
H  -6.84030778 4.86588907 -5.11472215
C  -5.55381827 2.39201662 -7.18373391
H  -5.99946953 2.76539046 -8.11517858
H  -5.57086193 1.29535551 -7.2133257
H  -4.50542378 2.71183661 -7.16520971
C  -7.79620579 2.49079334 -6.12055889
H  -8.19962081 2.89171838 -7.058592
H  -8.42155153 2.87019188 -5.30313761
H  -7.90045386 1.39929675 -6.15487934
O  -3.00463909 0.3663273 1.74281306
H  -3.02066356 -2.48973339 1.60044367
C  -4.21692595 -0.88592513 2.26902966
H  -4.91657493 -0.89924761 1.44269301
C  -3.38195306 -2.08777138 2.55540225
H  -4.05698757 -2.84126896 2.97721715
C  -2.22980657 -1.79567497 3.51777632
H  -1.83383023 -2.74520633 3.8970917
H  -1.41581675 -1.29844973 2.97645097
C  -2.70286206 -0.91656472 4.67317951
H  -1.9029851 -0.79198449 5.41320016
H  -3.53420231 -1.42490791 5.17940833
C  -3.17802693 0.45942795 4.19430061
H  -3.85124475 0.90657929 4.93439149
H  -2.33077046 1.14731542 4.07485504
C  -3.89014041 0.41463025 2.85582235
H  -4.64807048 1.19030378 2.72747283
Cl -6.35412369 -1.40214607 3.64835157
