program: Gaussian 16
title: Title Card Required
version: ES64L-G16RevC.01
frameworkgroup: C1[X(C10H8O4)]
method: RwB97XD
basis: def2TZVP
operation: Freq
keyword: #N
keyword: Geom=AllCheck
keyword: Guess=TCheck
keyword: SCRF=Check
keyword: GenChk
keyword: RwB97XD/def2TZVP
keyword: Freq
converged: YES YES YES YES
title: Mulliken charges:
elementType: C C C C C H H H H O O C C H C H O C H C H O
charge: 0.129547 0.129473 0.213857 -0.239127 -0.026799 0.134062 0.146147 0.161625 0.134066 -0.330049 -0.247444 0.213825 -0.078618 0.136850 -0.239129 0.146148 -0.330014 -0.078643 0.136846 -0.026780 0.161622 -0.247465
chargesum: -0.00000
title: Mulliken charges with hydrogens summed into heavy atoms:
elementType: C C C C C O O C C C O C C O
charge: 0.263609 0.263539 0.213857 -0.092981 0.134825 -0.330049 -0.247444 0.213825 0.058232 -0.092981 -0.330014 0.058204 0.134842 -0.247465
1716.lowfreq: -133.3603 -15.3050 -8.6883 -8.5944 0.0007 0.0009 0.0009 102.9574 127.9531
frequency: -133.2893 102.9564 127.9239 163.1006 206.7518 223.2117 283.6197 373.3256 432.1015 452.4774 454.5090 504.4683 509.8618 543.0300 557.9634 593.7574 614.0614 677.1935 742.9179 762.8511 790.5673 804.5939 814.4185 870.7014 872.1446 898.4692 964.6128 967.4556 974.9460 983.6449 1013.9887 1048.4924 1081.2546 1086.2809 1129.5038 1142.7772 1230.2107 1233.6913 1258.4887 1263.9240 1308.7141 1344.8070 1351.9468 1376.7387 1404.9554 1427.1533 1517.7419 1534.5700 1538.1431 1627.7982 1775.0665 1789.9654 3165.8855 3179.1950 3214.0421 3215.2668 3233.8702 3233.9166 3249.2251 3249.9653
redmass: 5.4208 6.4422 9.3203 8.8807 4.9903 6.5040 4.7401 5.9581 8.0029 5.8480 5.6822 5.9351 5.8581 4.8602 6.7182 5.5414 6.6698 3.3948 1.5859 3.0217 2.0645 2.7420 1.2474 4.5296 2.9371 1.6172 2.6383 1.6114 1.4456 2.4471 3.0254 4.7502 2.3801 2.2326 1.5741 1.2897 1.4913 2.2910 2.0112 1.7542 1.6707 1.9250 1.2347 1.5056 1.6523 2.0873 3.3223 2.9870 3.0552 5.9991 11.3157 11.3308 1.0891 1.0885 1.0882 1.0884 1.0936 1.0933 1.0966 1.0969
irintensity: 2.5041 1.2229 4.9986 0.6298 0.0937 0.7914 0.0685 4.7668 5.7492 13.2985 0.9305 1.6087 26.9599 8.4737 1.1699 4.7830 21.2296 0.4262 69.5697 0.1501 0.0175 14.0834 59.7049 23.7315 0.1025 0.2029 28.5096 21.3983 36.1057 13.4055 0.4725 7.5660 0.0605 33.1041 1.8174 23.4742 3.4673 281.2962 45.4982 1.9527 5.8033 99.4369 1.5377 3.0411 88.4607 47.8470 57.0269 4.0990 197.7357 41.5886 731.0413 180.6242 1.6179 3.7919 4.8011 1.3956 0.0009 0.5912 0.0085 1.4976
temp: 298.150 k
press: 1.00000 atm
elementType: 6 6 6 6 6 1 1 1 1 8 8 6 6 1 6 1 8 6 1 6 1 8
symmnumber: 1
zpe: 433617.7 jmol-1
zpe.correction: 0.165156 hartree
zpe.thermalcorrener: 0.174975 hartree
zpe.thermalcorrenthalpy: 0.175919 hartree
zpe.thermalcorrgfe: 0.130128 hartree
zpe.sumelectzpe: -686.526205 hartree
zpe.sumelectthermal: -686.516386 hartree
zpe.sumelectthermalent: -686.515442 hartree
zpe.sumelectthermalfe: -686.561233 hartree
dipole: -0.0001 0.0013 4.0025
dipole: 4.0025
quadrupole: -97.0410 -76.6786 -71.4589
quadrupole: -3.1875 -0.0001 0.0004
quadrupole: -15.3148 5.0475 10.2672 -3.1875 -0.0001 0.0004
hfenergy: -686.6913608 hartree
pointgroup: C01 [X(C10H8O4)]
dipole: -0.0233525 0.1257187 1.5695112 debye
dipolederiv: 0.0603278 -0.1540068 0.1499324 -0.0360676 0.3353584 0.1812987 0.2301318 -0.0126208 0.3142426 0.0713752 -0.1768946 -0.1310115 -0.0675604 0.3078399 -0.1826971 -0.229434 0.0077535 0.3309443 0.9907498 0.2091991 -0.3607995 0.5892296 0.1013603 -0.1771333 -1.3657027 0.1959613 0.8038028 -0.3965846 0.2112728 0.0752527 -0.2845322 0.3671722 -0.04551 0.8912939 -0.1768726 -0.3863801 -0.0192677 0.2040607 -0.0445888 0.1997947 0.2045264 -0.0421377 0.6053906 -1.0376209 0.8034126 0.0670256 -0.0164243 -0.0295479 -0.0078879 0.0730295 0.0157851 -0.0252138 0.006053 -0.0103252 0.0054463 -0.0317893 -0.038917 -0.0151322 0.0830532 -0.0084736 -0.0006002 -0.0159961 0.0329267 0.0764184 -0.0442979 -0.0083889 -0.0465596 0.0718593 -0.0293491 0.0083123 -0.0271035 0.0495937 0.0652878 -0.0109522 0.0339186 -0.0029335 0.0674337 -0.0283646 0.0282665 -0.0188737 -0.0029973 -1.1480322 -0.075403 0.3673082 -0.56597 -0.2996703 0.2104588 0.7560407 -0.0503717 -0.6600535 -0.2941311 0.1386457 -0.1892603 -0.1964206 -0.3320992 -0.1220266 -0.3108821 0.7093298 -0.9258655 0.941721 0.2682474 0.3267585 0.7922532 0.118666 0.3122585 1.2590899 -0.0741728 0.8356233 0.5303033 -0.3770716 0.2332963 0.4252522 -0.7083556 0.1618947 -0.122837 0.3356177 0.0106801 0.1159059 -0.0521197 -0.0315549 -0.0096655 0.1027842 -0.0158867 0.0061246 -0.0666855 -0.0192632 -0.3682244 0.1931103 -0.1067596 -0.4222717 0.3824776 -0.0914021 -0.8336408 0.0564475 -0.4300136 0.0041746 -0.0255868 0.0427002 -0.0149962 0.0855445 -0.0003566 0.002195 0.0067519 0.0316954 -1.1160964 -0.1346097 -0.364503 -0.6728108 -0.3358347 -0.2837826 -0.6707276 -0.0077316 -0.6558546 0.5332202 -0.4000734 -0.1565349 0.4432723 -0.7682386 -0.0235344 0.0676574 -0.2216946 0.0676014 0.1148985 -0.0477485 0.0437209 -0.0103528 0.112536 -0.0056185 -0.000361 0.0439979 -0.028 -0.0012055 0.1751577 -0.0069818 0.0966353 0.3900619 0.1118369 -0.6502624 1.1085292 0.5996048 0.0761692 -0.043094 0.0163226 -0.0479938 0.0799886 0.0230424 0.0001912 0.0209137 0.0417349 -0.3094817 0.190378 0.1796377 -0.1452827 -0.4394934 0.0396978 0.354968 -0.7816119 -0.8031096 unknown
polarizability: 157.9207903|-7.9667948|132.4103899|1.2520946|-1.3757522|116.8836008 unknown
InChI: InChI=1S/C10H8O4/c11-7-3-1-5-13-9(7)10-8(12)4-2-6-14-10/h1-6,9-10H
charge 0 multiplicity 1
22 atoms
C  -0.54150804 0.48690334 -1.2183814
C  0.57434515 -0.66867501 -1.10911338
C  1.78294965 -0.12316162 -0.3535836
C  1.67296989 -0.22410565 1.08723976
C  0.08764491 1.91874569 0.51171663
H  -0.81013335 0.61173798 -2.26262148
H  2.43498589 0.24846889 1.69127175
H  0.76752472 2.71684765 0.77301908
H  0.87340981 -0.95767125 -2.11172176
O  2.68218048 0.41621592 -0.96026313
O  0.01589374 1.71382635 -0.80104637
C  -1.77321598 0.06592041 -0.42162752
C  -0.80619024 1.36157854 1.39620447
H  -0.72721091 1.64963509 2.43582499
C  -1.7055005 0.39522862 0.98736947
H  -2.48613563 0.02308917 1.63619207
O  -2.65560027 -0.56504579 -0.96094932
C  0.7596782 -1.11514922 1.61806167
H  0.64937104 -1.23411316 2.68750277
C  -0.10898515 -1.80814344 0.80764669
H  -0.79828046 -2.55594034 1.17254975
O  0.00192206 -1.81475016 -0.51830715
