program: Gaussian 16
title: Busca de TS do rc_atv_CH_Ar_C6H5_para
version: EM64L-G16RevC.01
frameworkgroup: C1[X(C27H26N4O6Pd)]
method: RM06L
basis: def2SVP
operation: Freq
keyword: #P
keyword: Geom=AllCheck
keyword: Guess=TCheck
keyword: SCRF=Check
keyword: Test
keyword: GenChk
keyword: RM06L/def2SVPFreq
converged: YES YES YES YES
title: Mulliken charges:
elementType: Pd O N C H H C C C H H H O O N C C C C C C C H H H C C C C H C C O C H H C H H H H N H C N O H H H C O H H C C C C H C H C H H H
charge: 0.483328 -0.491927 -0.527844 0.080024 0.098875 0.089118 0.328013 0.287617 -0.105615 0.085389 0.108998 0.101651 -0.430577 -0.426356 -0.004533 0.089246 -0.257903 0.303594 0.026626 -0.121471 -0.060552 -0.008346 0.077633 0.076817 0.081068 -0.002640 -0.090860 -0.003690 -0.033896 0.078165 -0.290699 -0.004223 -0.434871 0.212412 0.068717 0.069234 0.083516 0.062070 0.074992 0.329095 0.049911 -0.304912 0.190386 0.344538 -0.184616 -0.426624 0.180914 0.049311 0.062203 0.237634 -0.329398 0.041253 0.075241 0.120134 -0.089324 -0.105865 -0.056780 0.045921 -0.050542 0.045208 -0.072985 0.056723 0.061017 0.060457
chargesum: -0.00000
title: Mulliken charges with hydrogens summed into heavy atoms:
elementType: Pd O N C C C C O O N C C C C C C C C C C C C C O C C N C N O C O C C C C C C
charge: 0.483328 -0.491927 -0.527844 0.268017 0.328013 0.287617 0.190422 -0.430577 -0.426356 -0.004533 0.089246 -0.257903 0.303594 0.101619 -0.043839 0.016265 0.072721 0.047271 -0.090860 0.074475 0.028307 0.038396 0.071018 -0.434871 0.350363 0.194897 -0.114526 0.344538 -0.003702 -0.426624 0.278887 -0.329398 0.120134 -0.043403 -0.060656 0.004237 0.009915 -0.016262
polarizability: 6.29856204e+02 2.64901473e+01 6.51251796e+02 7.26646339e+01 8.52610380e+01 4.48018919e+02
1716.lowfreq: -1586.8920 -8.9014 -7.1557 -0.0006 -0.0006 0.0008 5.2635 14.0129 18.2628
frequency: -1586.8920 9.7233 17.4646 20.4728 24.6087 28.1480 38.9337 44.7741 50.2437 55.3862 69.1360 69.9551 82.8242 91.5708 94.6719 102.2379 111.4065 114.7412 130.9962 139.3891 151.5084 155.9473 163.0302 174.2765 184.2426 187.4158 190.2069 218.0112 225.2004 237.2184 252.7176 253.7556 262.8852 278.3409 299.0638 299.9461 310.5892 321.0384 344.2200 348.2888 374.0566 381.6266 408.7720 413.8738 417.7999 422.3532 435.4901 455.5479 468.8194 486.4639 506.7190 510.8285 521.3536 548.0949 570.2723 581.9283 595.7113 596.7119 608.8082 611.0475 612.9048 626.2083 626.5429 654.2805 671.1518 684.3874 715.7227 734.3670 735.9174 749.7345 752.7402 760.8580 766.4303 772.1499 783.1373 814.4555 815.0302 837.0663 845.9610 847.3317 851.2740 871.2578 881.6713 910.6528 944.9616 948.0838 973.5795 980.2169 983.1362 986.5583 997.7533 1003.3689 1009.1014 1010.2561 1010.7012 1015.4865 1026.1421 1029.8888 1035.7175 1040.1227 1047.4568 1054.1837 1056.7133 1077.1568 1104.3677 1105.8929 1125.0656 1146.3647 1152.5032 1153.5381 1160.9023 1175.7831 1176.5786 1184.7251 1190.9258 1221.7674 1237.6317 1241.7814 1243.6488 1264.3463 1280.6455 1283.5617 1295.8097 1312.4684 1315.9359 1331.0574 1331.6116 1335.3447 1343.7202 1349.6707 1365.2214 1403.2474 1405.7904 1408.6034 1408.7188 1411.7660 1418.1303 1426.2008 1428.2685 1430.3710 1445.0259 1448.0834 1473.1620 1487.4197 1505.1184 1514.4532 1520.6773 1532.1205 1550.0625 1585.8132 1605.5237 1632.0592 1636.0375 1645.8294 1661.9922 1664.5951 1672.9763 1743.2877 1766.2161 1778.8359 2353.9681 2892.0722 3025.4350 3033.2277 3053.4164 3058.4912 3099.4564 3114.8786 3153.6579 3162.3789 3167.8507 3168.5546 3172.9712 3178.6450 3180.8645 3182.0886 3187.2029 3187.3105 3199.2931 3200.2340 3203.8864 3208.5108 3214.6158 3244.5175 3612.7997 3633.3857
redmass: 1.0998 6.6907 5.4277 5.7215 7.8545 6.0583 5.9500 6.9565 5.0446 5.4110 3.9302 5.9349 4.9354 6.0047 6.1462 5.4765 5.4170 5.8977 6.4040 5.7049 4.5928 3.1209 3.5650 1.9498 5.2189 4.3781 4.5630 3.6471 3.1389 4.2570 4.8617 4.9419 5.7008 6.5937 5.7399 5.1266 4.7352 5.1075 6.1423 4.8954 6.2725 8.2971 2.7823 4.8147 5.2461 2.9923 1.1126 7.6106 5.3105 5.9548 3.5106 7.3659 2.7323 4.4531 2.6527 6.2524 3.8067 4.2600 3.5521 2.3015 2.2354 6.0714 4.9490 4.4575 5.7656 4.9671 1.8252 1.8553 6.3082 4.5101 4.3986 4.1792 1.5393 2.3717 2.7234 1.5835 1.8077 4.6604 1.2470 4.7045 1.2658 4.8713 1.5316 1.4603 3.6032 4.8812 1.3687 1.4205 2.0547 1.3470 1.4022 1.2721 3.7420 4.7847 1.3441 3.8262 1.7286 1.8538 7.2861 2.0580 2.0112 1.9913 1.8914 3.3792 1.3092 1.4657 1.6013 1.9006 1.0694 1.1441 1.1369 2.4193 1.6149 1.2240 2.3224 2.5522 1.1497 2.4440 1.3150 2.0143 1.7570 1.3276 1.6286 2.1736 1.4759 1.6599 1.5889 1.1899 1.3330 1.3682 2.5315 1.8332 9.6439 1.0896 1.1902 4.8155 1.2745 1.5075 2.6404 1.1210 1.9199 1.1463 2.5300 2.7156 2.6001 3.0205 5.9495 2.4013 2.0500 2.1329 6.8986 6.9659 7.2499 6.1764 4.1487 6.7864 6.2008 12.4188 7.6526 9.3674 12.6914 1.0850 1.0641 1.0636 1.0644 1.0398 1.1018 1.1044 1.1061 1.0888 1.1024 1.0876 1.0854 1.0896 1.0960 1.0970 1.0876 1.0952 1.1002 1.0913 1.0960 1.1064 1.1002 1.0933 1.0774 1.0798
irintensity: 4373.5909 0.3986 0.5986 0.8887 2.2419 1.4431 9.8340 0.0898 3.9251 0.2157 15.2090 2.5560 6.3042 1.8736 9.2433 7.4946 4.0036 2.4342 3.3365 18.9682 3.7562 11.9062 8.4575 5.9442 0.6932 2.2540 10.4211 2.4143 8.4875 18.8964 5.3264 11.4295 0.3561 9.6985 26.7600 19.8677 19.9712 7.6059 3.7756 11.7591 25.1747 120.1024 11.5316 14.0247 10.0673 1.2962 81.9778 14.5175 11.8915 2.0471 17.7072 19.1582 33.1673 9.7699 12.3717 5.8653 16.8691 0.9686 33.5878 32.8913 139.7433 13.1554 13.0690 15.2192 33.8122 12.4871 39.9448 41.8039 28.7970 9.9151 11.9455 11.7641 48.6184 77.6670 26.4321 43.0443 42.0911 8.8981 0.9921 101.4291 1.2406 4.6839 4.9945 12.8668 14.9239 13.6516 1.8149 6.8019 16.9225 0.2203 0.4138 1.0464 4.8602 0.8439 0.1989 3.3267 26.6423 0.5548 168.1706 2.8475 13.7306 17.1643 25.5808 8.5114 9.4782 15.9104 66.6753 9.3760 0.8885 7.1688 10.4599 50.2951 591.2772 12.1600 109.5162 51.3787 7.4385 142.2532 135.6218 614.6422 55.9167 329.0012 36.1063 33.8375 16.7547 270.2661 146.9285 28.1236 54.2495 76.7217 448.6981 142.5414 12.3819 25.8213 6.1176 101.1664 56.8037 6.4981 38.4408 45.9946 13.0774 20.1701 41.1471 84.0787 6.2083 233.5799 24.4622 412.9698 361.5037 714.3140 56.8138 62.5510 634.2974 317.0216 121.5722 138.0391 70.1359 1269.1672 315.0929 801.0121 147.5961 237.3384 56.5167 28.3993 79.8683 12.6080 8.7179 6.1894 21.3120 8.7556 2.2391 1.2005 8.5890 7.9378 28.1438 2.2197 4.5674 33.9521 24.0776 2.6261 4.8465 4.5493 10.0966 0.8327 46.3037 162.2442
temp: 298.150 k
press: 1.00000 atm
elementType: 46 8 7 6 1 1 6 6 6 1 1 1 8 8 7 6 6 6 6 6 6 6 1 1 1 6 6 6 6 1 6 6 8 6 1 1 6 1 1 1 1 7 1 6 7 8 1 1 1 6 8 1 1 6 6 6 6 1 6 1 6 1 1 1
symmnumber: 1
zpe: 1283315.8 jmol-1
zpe.correction: 0.488789 hartree
zpe.thermalcorrener: 0.525052 hartree
zpe.thermalcorrenthalpy: 0.525996 hartree
zpe.thermalcorrgfe: 0.415722 hartree
zpe.sumelectzpe: -1841.022614 hartree
zpe.sumelectthermal: -1840.986351 hartree
zpe.sumelectthermalent: -1840.985407 hartree
zpe.sumelectthermalfe: -1841.095681 hartree
dipole: 6.0018 11.4578 9.9392
dipole: 16.3123
quadrupole: -262.8471 -157.1207 -254.6922
quadrupole: 6.7784 -30.9326 6.2351
quadrupole: -37.9604 67.7660 -29.8056 6.7784 -30.9326 6.2351
hfenergy: -1841.5114028 hartree
pointgroup: C01 [X(C27H26N4O6Pd1)]
dipole: 2.3309867 4.5106875 3.9252674 debye
polarizability: 629.3383494|26.0570264|651.1107522|72.5761852|86.1830555|448.6778168 unknown
InChI: InChI=1/27C.4N.6O.Pd.26H
charge 0 multiplicity 1
64 atoms
Pd -2.6157109 -0.91771683 -0.03977502
O  -3.94873111 -0.9389039 -1.62950284
N  -3.08421798 -2.86384574 -0.04263649
C  -3.80817491 -3.30115025 -1.21554722
H  -3.18045986 -3.92313835 -1.87865727
H  -4.68131393 -3.9208222 -0.95428831
C  -4.30732767 -2.12103132 -2.03056184
C  -2.92132007 -3.61130327 1.03197818
C  -3.41265537 -5.02316421 1.04936116
H  -3.06727819 -5.53191562 1.95444844
H  -4.51207576 -5.04106588 1.03481949
H  -3.06854526 -5.57677168 0.16594824
O  -5.01185159 -2.30375354 -3.01712727
O  -2.35241585 -3.15191755 2.07262576
N  -2.35879404 1.10106251 -0.13611902
C  -2.20629054 2.25368745 -0.14834165
C  -1.95185201 3.64605152 -0.13146356
C  -0.83546252 4.11317139 -0.86379437
C  -2.72845953 4.53569183 0.63250355
C  -0.48291423 5.46109641 -0.78424552
C  -2.37463453 5.87598205 0.68730331
C  -1.2523268 6.32918056 -0.01416929
H  0.37705088 5.82791506 -1.34786536
H  -2.97079166 6.57214238 1.27952822
H  -0.97709099 7.38549749 0.03064882
C  1.4042548 -1.0876038 1.37740028
C  1.4648687 -0.03879355 2.31078449
C  0.17259917 -1.54255683 0.93211203
C  0.27828312 0.53657417 2.79257682
H  0.12782405 -2.37297907 0.22074612
C  -1.0331519 -0.97564585 1.40937254
C  -0.95435565 0.06831862 2.35538287
O  -0.19665349 3.21394904 -1.64228392
C  1.21508675 3.05758639 -1.48596472
H  1.55199129 2.508975 -2.37461861
H  1.72760194 4.03335693 -1.47468933
C  1.48751007 2.25915764 -0.22368848
H  1.19527107 2.84213281 0.66333881
H  -3.59080585 4.15629468 1.18301803
H  -1.88130439 -1.92580972 1.69758961
H  2.33483287 -1.52969315 1.00986601
N  2.86589067 1.8736189 -0.08197096
H  3.45054779 2.37346692 0.57902373
C  3.33842885 0.7506647 -0.7019448
N  4.63910339 0.43889118 -0.36445705
O  2.64992829 0.09712011 -1.4809328
H  5.02634688 0.94778378 0.42455825
H  0.85210717 1.35698372 -0.24381345
H  0.33658812 1.35130189 3.52148912
C  2.75788158 0.47127974 2.78595196
O  3.84224846 -0.00137898 2.49756829
H  2.68430231 1.36101913 3.46304404
H  -1.87285478 0.51095011 2.75072868
C  5.33964554 -0.72370256 -0.69604993
C  6.40137576 -1.09968605 0.14537592
C  5.05908369 -1.50775817 -1.82765362
C  7.16316211 -2.22890127 -0.13468542
H  6.61836051 -0.49292568 1.02927478
C  5.82687318 -2.64166522 -2.08976674
H  4.24935141 -1.22686659 -2.49780922
C  6.87944681 -3.0135395 -1.25379767
H  7.47392524 -3.90344027 -1.47284851
H  7.98358225 -2.50023653 0.5346997
H  5.59530362 -3.24068098 -2.97462602
