program: Gaussian 16
title: Busca de TS do rc_atv_CH_ciclohexil
version: EM64L-G16RevC.01
frameworkgroup: C1[X(C27H26N4O6Pd)]
method: RM06L
basis: def2SVP
operation: Freq
keyword: #P
keyword: Geom=AllCheck
keyword: Guess=TCheck
keyword: SCRF=Check
keyword: Test
keyword: GenChk
keyword: RM06L/def2SVPFreq
converged: YES YES NO YES
title: Mulliken charges:
elementType: Pd O N C H H C C C H H H O O N C C C C C C C H H H C C C C H H C C H C H O O C H H C H H H H N H C N O H H C C C C H C H C H H H
charge: 0.455326 -0.490362 -0.449142 0.062898 0.106543 0.068505 0.316308 0.235985 -0.091769 0.091213 0.105486 0.110866 -0.461796 -0.248736 -0.017897 0.114528 -0.291696 0.352488 0.031682 -0.171012 -0.071834 -0.001054 0.074413 0.073198 0.079248 -0.043687 -0.041586 -0.040445 -0.081768 0.061873 0.067555 -0.228915 0.001498 -0.021070 0.251477 0.041939 -0.331669 -0.398237 0.139960 0.070309 0.082136 0.117307 0.078770 0.073556 0.270888 0.065397 -0.313390 0.183074 0.361797 -0.204586 -0.416224 0.181016 0.064678 0.119310 -0.089632 -0.085138 -0.059325 0.043099 -0.052029 0.050458 -0.073118 0.056872 0.059210 0.055248
chargesum: -0.00000
title: Mulliken charges with hydrogens summed into heavy atoms:
elementType: Pd O N C C C C O O N C C C C C C C C C C C C C C O O C C N C N O C C C C C C
charge: 0.455326 -0.490362 -0.449142 0.237946 0.316308 0.235985 0.215796 -0.461796 0.022152 -0.017897 0.114528 -0.291696 0.352488 0.105239 -0.096598 0.001364 0.078194 0.021710 0.020287 0.027111 -0.081768 -0.228915 -0.019573 0.293416 -0.331669 -0.398237 0.292405 0.260755 -0.130316 0.361797 -0.023570 -0.416224 0.119310 -0.046532 -0.034680 -0.002453 0.007181 -0.017870
chargesum: 0.00000
polarizability: 7.39009984e+02 3.49849621e+01 4.23148707e+02 6.43707524e+01 -8.64204700e-01 4.81037419e+02
1716.lowfreq: -0.0006 -0.0004 0.0006 1.7234 9.5790 13.0698 19.2760 25.7498 33.9892
frequency: 18.4819 24.8249 33.5702 41.0072 46.7374 51.3968 55.4683 62.6630 67.5868 77.3045 82.0889 89.3534 96.4334 99.4358 108.9174 118.0178 126.6616 135.4230 139.0371 147.2980 156.5283 159.7626 168.0237 185.2403 192.3282 203.0443 228.4230 232.9433 244.5988 248.7940 257.7741 260.2902 269.4058 284.3994 298.0848 313.5708 317.0433 337.3456 342.2282 353.5322 386.3211 414.3206 418.3831 419.1729 430.3026 446.8586 449.5304 452.7203 483.4147 510.3049 516.8640 525.9974 541.2329 544.8330 552.8890 560.0182 575.9834 588.5867 610.9553 614.0957 617.1086 625.6695 646.8080 653.2389 666.2570 673.4732 711.8254 714.8276 739.9665 741.7899 755.0091 760.5318 764.5179 766.8721 788.6039 794.7354 827.0692 839.0951 857.0239 865.8287 887.5834 905.6930 921.6209 927.1954 930.4865 952.7945 957.1244 965.0955 970.2507 976.5614 977.2065 996.3664 1005.4497 1006.0526 1008.3043 1008.7918 1023.8186 1024.7380 1036.9485 1037.4382 1054.0896 1068.4303 1073.5269 1077.9966 1103.4344 1108.3442 1124.5994 1129.0997 1133.5134 1148.3909 1160.2185 1161.1574 1172.9139 1177.8130 1228.8629 1232.9419 1241.8173 1243.6652 1272.2759 1275.2580 1285.1148 1288.9972 1310.0413 1314.0265 1325.0519 1328.5104 1343.3595 1348.7526 1387.2591 1390.7674 1391.6620 1395.8418 1403.9980 1412.2759 1412.6694 1416.2436 1416.9880 1428.0381 1430.2522 1443.3154 1451.5680 1471.9386 1484.4550 1488.9552 1489.1415 1525.8866 1529.2305 1562.0561 1582.7556 1613.4172 1633.5936 1635.0847 1658.7078 1665.8246 1670.7150 1698.9976 1726.3008 1766.8573 1775.5855 2332.2928 2901.0981 3029.2152 3035.7832 3060.9364 3073.2700 3109.9134 3114.8080 3158.5117 3159.9960 3165.0710 3165.9838 3171.4868 3173.3768 3177.3543 3179.8802 3187.5223 3189.0251 3193.1222 3202.7806 3207.0036 3215.2696 3223.0975 3255.9847 3575.0861 3601.3046 3622.6799
redmass: 5.7895 6.1012 7.0208 7.7174 8.3406 7.5013 5.7246 7.3459 4.4069 5.6522 7.2989 6.6217 5.2593 4.8042 6.4579 4.8185 5.1349 5.5961 5.1701 5.1681 4.6239 1.2329 5.4196 4.6244 4.2693 6.3643 5.9184 4.7220 3.9505 4.7654 3.8804 4.4986 6.8989 6.7619 5.6952 5.3728 4.5396 3.8622 3.7377 7.5569 4.9421 4.2230 2.9844 5.6995 6.9951 2.2090 1.4609 3.7825 4.2295 3.4290 2.5725 3.8314 3.5443 3.5144 2.4176 1.2310 2.6776 5.0712 6.0198 5.1317 5.6051 5.8181 4.4139 6.3145 4.1198 1.6699 1.9422 2.1508 7.4380 4.4230 2.2183 5.1107 1.7063 2.0493 5.1393 1.5473 4.2358 1.2832 4.1921 1.5712 5.2852 1.4480 3.4890 3.3124 1.3737 1.3020 4.4628 1.9688 1.4372 1.9464 1.5091 1.2898 1.3232 2.2505 2.1811 5.0453 3.5562 1.7395 1.6910 1.8418 2.0236 1.9595 3.5456 1.9979 1.4497 1.4368 3.4994 1.9676 1.8039 1.0647 1.1026 1.1073 2.6072 1.1610 2.6489 2.4405 1.5232 1.1603 1.7420 1.4026 1.3031 1.7288 1.6290 1.7043 1.7373 1.7620 1.3288 1.3504 1.6778 3.7537 1.4277 1.3206 2.7757 1.9135 1.7854 1.2667 2.1181 1.7883 1.9404 2.2531 1.1397 2.5835 2.6067 2.7820 2.6808 2.9043 2.5383 1.9112 2.1841 6.6428 6.9737 6.0865 4.1870 6.7200 6.3950 8.7585 11.9967 7.3544 9.6313 12.6836 1.0849 1.0648 1.0600 1.0404 1.0655 1.1012 1.1090 1.1034 1.0879 1.0858 1.1018 1.0902 1.0889 1.0885 1.0955 1.0889 1.0984 1.0999 1.0910 1.1061 1.0991 1.0950 1.0924 1.0646 1.0787 1.0787
irintensity: 1.6079 1.6439 0.6879 3.8766 8.1670 2.5580 4.7865 1.4744 2.1811 1.7037 1.1347 16.3927 0.6002 5.9520 6.9947 4.7084 3.5472 6.2535 1.8662 7.9729 8.1976 3.8865 2.3671 0.0949 4.6958 8.1862 14.2407 7.6222 7.9868 2.9980 3.1236 0.1854 27.8114 0.4455 7.2912 1.3289 39.0153 2.9327 1.8497 81.6497 23.5984 7.1996 0.4758 2.3297 8.0203 32.6973 31.2038 14.5520 24.2133 14.5244 62.7767 8.1651 6.5629 17.8198 46.8042 202.3800 7.1340 12.1482 2.0207 12.8571 5.9430 3.1734 22.4712 15.3919 110.8125 174.3048 45.7858 23.0208 58.9812 16.0325 18.0142 0.8815 75.5050 86.2590 7.6067 35.4390 3.5658 1.3539 3.0732 4.8550 32.1633 9.0900 7.3422 36.7435 2.0120 12.8337 26.2837 9.6433 4.5369 19.0416 5.1233 0.4666 0.2994 2.5066 3.0776 2.5573 20.2247 11.0892 6.8864 0.6472 11.1372 21.3428 78.4093 18.5524 15.5027 2.2187 50.1006 16.3537 40.3530 1.1599 28.4354 17.9463 1.1424 8.5287 188.9284 40.4017 250.5460 8.0775 270.7833 400.0588 17.4591 39.1313 71.7274 162.4711 134.4232 207.3450 12.7484 0.1861 307.2617 37.7947 30.1118 22.9856 21.1053 61.5526 89.5295 123.9236 43.5855 36.9116 312.4162 17.1663 65.1335 45.5936 25.4020 51.8607 23.9781 192.2256 274.5967 498.7870 715.6248 64.4881 68.0435 64.2041 99.5547 214.3534 78.8194 410.2443 1535.3804 445.2831 677.8814 246.1215 250.7121 33.8481 56.9711 5.4140 57.2306 10.6363 25.3743 5.5545 3.1121 9.1907 0.0571 7.9380 3.7164 0.3559 33.3503 6.6845 32.6943 24.4465 3.4627 2.8084 11.6453 1.9917 2.9464 491.9553 20.6926 156.7493
temp: 298.150 k
press: 1.00000 atm
elementType: 46 8 7 6 1 1 6 6 6 1 1 1 8 8 7 6 6 6 6 6 6 6 1 1 1 6 6 6 6 1 1 6 6 1 6 1 8 8 6 1 1 6 1 1 1 1 7 1 6 7 8 1 1 6 6 6 6 1 6 1 6 1 1 1
symmnumber: 1
zpe: 1301669.0 jmol-1
zpe.correction: 0.495780 hartree
zpe.thermalcorrener: 0.531893 hartree
zpe.thermalcorrenthalpy: 0.532837 hartree
zpe.thermalcorrgfe: 0.426602 hartree
zpe.sumelectzpe: -1841.059923 hartree
zpe.sumelectthermal: -1841.023810 hartree
zpe.sumelectthermalent: -1841.022866 hartree
zpe.sumelectthermalfe: -1841.129101 hartree
dipole: 10.1713 -4.1680 14.4574
dipole: 18.1616
quadrupole: -178.8108 -208.0288 -253.3379
quadrupole: 15.0263 -38.9409 9.7795
quadrupole: 34.5817 5.3637 -39.9454 15.0263 -38.9409 9.7795
hfenergy: -1841.5557028 hartree
pointgroup: C01 [X(C27H26N4O6Pd1)]
dipole: 4.2591793 -0.6560234 5.699533 debye
polarizability: 744.8348726|42.1311455|423.5392003|45.0862999|6.6383497|474.8220372 unknown
InChI: InChI=1/27C.4N.6O.Pd.26H
charge 0 multiplicity 1
64 atoms
Pd -0.93756476 -0.98689478 -0.54364553
O  -2.04610089 -0.71618621 -2.34699088
N  -2.86493909 -1.11644982 0.20944992
C  -3.81430614 -1.36884978 -0.86651108
H  -4.04316227 -2.44826494 -0.92989204
H  -4.77626089 -0.86432084 -0.6877333
C  -3.30487625 -0.94159146 -2.23714102
C  -3.3115374 -1.000664 1.41833115
C  -4.72674952 -1.20467322 1.81578706
H  -4.83645252 -1.10710467 2.90024489
H  -5.381925 -0.46993059 1.32764342
H  -5.07527875 -2.19897591 1.50466291
O  -4.11494011 -0.86850988 -3.16356361
O  -2.51183398 -0.70244556 2.42829942
N  0.89463018 -0.92083838 -1.40863661
C  2.05286375 -0.98404723 -1.51397288
C  3.46304751 -1.04899479 -1.54065382
C  4.18774033 0.09479692 -1.11131108
C  4.13905162 -2.22562205 -1.907485
C  5.58185548 0.0196652 -1.02688655
C  5.52375415 -2.2763589 -1.83920923
C  6.23168223 -1.15674755 -1.39281092
H  6.15940261 0.87682839 -0.68025656
H  6.05216505 -3.18739997 -2.12394402
H  7.32146592 -1.19771455 -1.32545621
C  0.71234757 -2.97295823 2.88939526
C  1.73486954 -2.12805406 3.31105293
C  -0.09858411 -2.60747869 1.81090691
C  1.93972476 -0.90876525 2.65018928
H  2.38257011 -2.40461087 4.14828537
H  -0.90036465 -3.28554459 1.50024264
C  0.09321884 -1.38979837 1.13008468
C  1.11873438 -0.54716334 1.56757168
H  1.33086518 0.402122 1.06576782
C  3.03462785 -0.02817414 3.07180868
H  3.64672387 -0.42150516 3.92303241
O  3.3004668 1.04785465 2.56591309
O  3.45225994 1.17043835 -0.82143634
C  4.08715655 2.37837307 -0.40558239
H  4.49733219 2.2437935 0.60857523
H  4.9185624 2.62796537 -1.08382757
C  3.0507217 3.47247882 -0.46372658
H  3.52249055 4.4099835 -0.13488712
H  3.55811831 -3.08907073 -2.23559263
H  -1.60411229 -0.55344942 2.0909614
H  0.54174036 -3.9263872 3.39604984
N  1.86640565 3.218958 0.3143288
H  1.93382485 3.28754897 1.32461013
C  0.69892858 2.79945251 -0.26000555
N  -0.32528728 2.62969147 0.65250561
O  0.57755945 2.60652891 -1.46648907
H  -0.09644323 2.80231523 1.62671156
H  2.73593039 3.61659564 -1.5054745
C  -1.68552723 2.42515567 0.40993053
C  -2.53388858 2.39672639 1.53167131
C  -2.2492649 2.25745903 -0.86742091
C  -3.90290344 2.20406326 1.38489964
H  -2.10094262 2.51924463 2.52905883
C  -3.62407916 2.06727079 -0.9975438
H  -1.61245363 2.26619517 -1.74852628
C  -4.46231924 2.03768237 0.11659734
H  -4.53674255 2.17765325 2.27588468
H  -4.04198118 1.93109282 -1.99913711
H  -5.53820199 1.88565024 -0.00113519
