program: Orca
programVersion: 5.0.3
elementType: Ir C C C C C H H C H H H H C O C C C C C C C C C C C H H H H H H H H H H H H H H H P H N H H C H C H H H C C H Fe C H C H C H C C H C H H C C H H C C C H C H C H C H H C C H C C H C C H H H H C H H C H H C H H C H H H
elementType: Ir
charge: 0
multiplicity: 1
keywords: wB97X-D3BJ def2-SVP def2/J TightOpt VeryTightSCF defgrid3 Freq
frequency: 0.00 0.00 0.00 0.00 0.00 0.00 15.00 18.77 23.70 27.26 35.33 43.07 48.72 53.89 58.00 59.11 64.05 66.75 72.40 78.86 80.60 83.18 92.96 94.69 96.70 102.14 107.96 113.40 124.80 126.58 137.55 144.66 147.88 154.34 162.16 168.46 172.61 184.54 187.54 189.25 195.84 202.97 211.52 225.86 232.95 236.18 242.48 244.15 251.84 252.63 256.88 267.06 273.15 283.26 301.60 301.90 307.79 325.93 343.31 355.11 360.29 365.93 372.54 377.67 393.95 401.25 407.99 415.11 423.60 425.22 430.54 439.58 443.74 454.35 459.94 460.74 477.40 491.00 494.86 499.09 512.58 517.56 521.36 529.78 554.08 556.25 559.90 589.15 592.70 601.77 602.37 618.23 620.61 624.33 633.90 635.16 641.06 647.16 655.49 684.21 712.12 721.70 726.36 727.75 736.96 738.20 739.40 741.67 761.94 780.68 785.45 791.25 800.12 815.90 849.56 851.85 853.02 857.72 860.60 862.26 872.43 872.83 877.99 880.57 884.20 888.87 894.87 899.21 911.39 919.47 930.03 944.37 950.57 954.32 960.16 963.46 964.36 985.10 992.41 999.02 1001.00 1009.77 1016.88 1024.77 1026.22 1027.74 1029.11 1030.31 1032.87 1038.65 1042.85 1044.91 1049.38 1049.56 1052.52 1055.58 1058.82 1060.67 1062.09 1062.36 1064.14 1064.92 1065.48 1069.96 1072.38 1082.64 1087.74 1097.96 1098.82 1099.94 1106.30 1107.65 1111.40 1118.94 1121.43 1137.19 1143.79 1150.54 1159.44 1162.20 1162.51 1162.73 1165.38 1177.13 1186.60 1187.86 1196.67 1210.83 1211.50 1230.63 1238.31 1260.15 1260.81 1271.04 1279.77 1280.77 1281.51 1299.13 1305.40 1307.52 1314.36 1322.82 1323.38 1324.36 1331.55 1344.81 1350.19 1351.84 1362.05 1369.41 1373.15 1382.02 1391.12 1394.58 1396.43 1397.53 1399.04 1402.97 1404.32 1409.27 1411.30 1413.32 1416.67 1429.53 1435.30 1439.00 1443.49 1443.82 1447.52 1451.60 1452.05 1456.46 1456.56 1458.83 1459.44 1460.30 1462.30 1464.16 1465.10 1467.11 1469.01 1471.70 1473.59 1478.69 1479.97 1481.66 1482.12 1482.37 1485.41 1485.65 1488.19 1495.95 1498.07 1517.43 1525.82 1529.37 1535.85 1553.67 1603.70 1672.72 1674.21 1675.99 1681.79 1693.26 1695.82 1697.36 1723.95 2225.74 3047.45 3051.03 3055.44 3059.30 3061.62 3064.01 3066.20 3066.84 3068.44 3069.57 3070.06 3073.25 3076.62 3089.83 3093.92 3103.25 3113.50 3116.40 3123.97 3136.85 3138.95 3139.75 3141.33 3142.24 3145.00 3148.26 3150.02 3150.90 3162.89 3165.67 3179.57 3195.84 3197.09 3203.29 3203.51 3204.99 3208.07 3209.64 3210.95 3213.12 3215.54 3219.56 3222.48 3227.98 3230.01 3233.14 3256.03 3260.29 3263.11 3272.41 3273.81 3275.46 3286.60 3288.25 3534.93 3599.92
frequency: 15.00 18.77 23.70 27.26 35.33 43.07 48.72 53.89 58.00 59.11 64.05 66.75 72.40 78.86 80.60 83.18 92.96 94.69 96.70 102.14 107.96 113.40 124.80 126.58 137.55 144.66 147.88 154.34 162.16 168.46 172.61 184.54 187.54 189.25 195.84 202.97 211.52 225.86 232.95 236.18 242.48 244.15 251.84 252.63 256.88 267.06 273.15 283.26 301.60 301.90 307.79 325.93 343.31 355.11 360.29 365.93 372.54 377.67 393.95 401.25 407.99 415.11 423.60 425.22 430.54 439.58 443.74 454.35 459.94 460.74 477.40 491.00 494.86 499.09 512.58 517.56 521.36 529.78 554.08 556.25 559.90 589.15 592.70 601.77 602.37 618.23 620.61 624.33 633.90 635.16 641.06 647.16 655.49 684.21 712.12 721.70 726.36 727.75 736.96 738.20 739.40 741.67 761.94 780.68 785.45 791.25 800.12 815.90 849.56 851.85 853.02 857.72 860.60 862.26 872.43 872.83 877.99 880.57 884.20 888.87 894.87 899.21 911.39 919.47 930.03 944.37 950.57 954.32 960.16 963.46 964.36 985.10 992.41 999.02 1001.00 1009.77 1016.88 1024.77 1026.22 1027.74 1029.11 1030.31 1032.87 1038.65 1042.85 1044.91 1049.38 1049.56 1052.52 1055.58 1058.82 1060.67 1062.09 1062.36 1064.14 1064.92 1065.48 1069.96 1072.38 1082.64 1087.74 1097.96 1098.82 1099.94 1106.30 1107.65 1111.40 1118.94 1121.43 1137.19 1143.79 1150.54 1159.44 1162.20 1162.51 1162.73 1165.38 1177.13 1186.60 1187.86 1196.67 1210.83 1211.50 1230.63 1238.31 1260.15 1260.81 1271.04 1279.77 1280.77 1281.51 1299.13 1305.40 1307.52 1314.36 1322.82 1323.38 1324.36 1331.55 1344.81 1350.19 1351.84 1362.05 1369.41 1373.15 1382.02 1391.12 1394.58 1396.43 1397.53 1399.04 1402.97 1404.32 1409.27 1411.30 1413.32 1416.67 1429.53 1435.30 1439.00 1443.49 1443.82 1447.52 1451.60 1452.05 1456.46 1456.56 1458.83 1459.44 1460.30 1462.30 1464.16 1465.10 1467.11 1469.01 1471.70 1473.59 1478.69 1479.97 1481.66 1482.12 1482.37 1485.41 1485.65 1488.19 1495.95 1498.07 1517.43 1525.82 1529.37 1535.85 1553.67 1603.70 1672.72 1674.21 1675.99 1681.79 1693.26 1695.82 1697.36 1723.95 2225.74 3047.45 3051.03 3055.44 3059.30 3061.62 3064.01 3066.20 3066.84 3068.44 3069.57 3070.06 3073.25 3076.62 3089.83 3093.92 3103.25 3113.50 3116.40 3123.97 3136.85 3138.95 3139.75 3141.33 3142.24 3145.00 3148.26 3150.02 3150.90 3162.89 3165.67 3179.57 3195.84 3197.09 3203.29 3203.51 3204.99 3208.07 3209.64 3210.95 3213.12 3215.54 3219.56 3222.48 3227.98 3230.01 3233.14 3256.03 3260.29 3263.11 3272.41 3273.81 3275.46 3286.60 3288.25 3534.93 3599.92
formula: C46H57IrFeNOP
InChI: InChI=1/C22H33O.C19H19NP.C5H5.Fe.Ir/c1-7-8-10-19-11-9-12-20(13-19)22(23)21-17(5)15(3)14(2)16(4)18(21)6;1-15(20)18-13-8-14-19(18)21(16-9-4-2-5-10-16)17-11-6-3-7-12-17;1-2-4-5-3-1;;/h19H,7-13H2,1-6H3;2-15H,20H2,1H3;1-5H;;/rC46H57FeIrNOP/c1-8-9-17-30-18-16-23-43(42(50)33-27(5)25(3)24(2)26(4)28(33)6)46(30)48(43,52-46)49-29(7)44-40-39-41-45(44,47(39,40,41,44)34-35(47)37(47)38(47)36(34)47)51(48,31-19-12-10-13-20-31)32-21-14-11-15-22-32/h10-15,19-22,29-30,34-41,46H,8-9,16-18,23,49H2,1-7H3
108 atoms
Ir 12.090606 7.161246 5.003706
C  14.049665 5.888486 4.832809
C  13.405732 6.371901 3.545555
C  14.240445 4.377134 5.064116
C  12.796012 5.351611 2.56799
C  13.253287 3.906412 2.791395
H  12.992815 5.653846 1.530106
H  11.703498 5.359558 2.673539
C  13.217788 3.552394 4.276814
H  14.273008 3.750853 2.400538
H  12.595923 3.227872 2.221761
H  13.402205 2.477849 4.431547
H  12.211592 3.756326 4.677552
C  14.136514 7.556765 3.035426
O  14.890118 8.218768 3.75891
C  14.014118 8.03836 1.600794
C  13.443591 9.303232 1.360782
C  13.453894 9.819195 0.052801
C  13.990559 9.054989 -1.004547
C  14.58791 7.806039 -0.751542
C  14.638612 7.314911 0.569305
C  12.870972 10.100557 2.512269
C  12.919418 11.19887 -0.261054
C  13.945157 9.631584 -2.40326
C  15.201218 7.012594 -1.888954
C  15.429318 6.058528 0.880312
H  12.602362 9.442158 3.350234
H  11.965232 10.641609 2.213791
H  13.604367 10.836952 2.881825
H  14.989654 5.161793 0.416026
H  15.493058 5.875169 1.95978
H  16.459947 6.149988 0.502703
H  14.476115 6.861559 -2.703783
H  15.538475 6.02089 -1.566607
H  16.070622 7.534051 -2.323252
H  12.90955 9.866526 -2.699041
H  14.362913 8.953999 -3.156159
H  14.507815 10.578203 -2.457161
H  12.532333 11.713213 0.625051
H  12.105785 11.153424 -1.001989
H  13.710498 11.830714 -0.697906
P  10.12271 7.611958 4.138856
H  13.476391 6.273878 5.802002
N  11.410573 7.806926 6.957929
H  12.242258 7.83079 7.550065
H  10.810735 7.089403 7.366073
C  10.715041 9.10701 7.100107
H  10.597038 9.321046 8.176554
C  11.533281 10.227316 6.463901
H  12.541534 10.271089 6.905881
H  11.634461 10.049702 5.382996
H  11.036846 11.195467 6.629369
C  9.331154 9.022406 6.518172
C  8.160652 9.586023 7.108685
H  8.121843 10.094408 8.072538
Fe 7.937744 7.569815 6.841374
C  8.632279 5.684182 7.250101
H  9.564929 5.260276 6.878934
C  8.464915 6.425365 8.460214
H  9.247244 6.668772 9.180517
C  7.095351 6.819917 8.547877
H  6.652968 7.425509 9.339048
C  7.534599 8.585942 5.127088
C  8.949246 8.404669 5.279135
H  6.929044 8.208928 4.304771
C  7.054274 9.318463 6.249261
H  6.01471 9.583588 6.442271
H  7.172808 5.152273 5.625852
C  7.366931 5.620731 6.59008
C  6.417866 6.318893 7.395096
H  5.367727 6.479994 7.150545
H  8.967043 10.333587 3.623333
C  9.913458 8.654647 2.637993
C  9.323986 9.923652 2.675643
C  9.186539 10.674358 1.504082
H  8.723203 11.664651 1.545391
C  9.633112 10.159945 0.285329
H  9.520477 10.744841 -0.632068
C  10.233854 8.898305 0.243533
H  10.605416 8.497756 -0.703878
C  10.37694 8.154085 1.413358
H  10.858181 7.172635 1.375945
H  7.744858 7.141251 2.363073
C  8.059286 6.18152 2.781967
C  9.183081 6.112461 3.617267
H  10.473715 4.836214 4.746428
C  9.584791 4.867036 4.111092
C  8.873955 3.707646 3.79489
H  9.203585 2.741383 4.188432
C  7.743654 3.786704 2.977196
C  7.338674 5.025957 2.4706
H  6.460128 5.09198 1.821949
H  7.181151 2.882244 2.726869
H  15.002002 6.413269 4.984586
H  14.095482 4.166285 6.138125
C  15.70023 4.017863 4.727283
H  16.353059 4.592876 5.407533
H  15.945842 4.373669 3.711206
C  16.053999 2.536229 4.84109
H  15.715786 2.150573 5.821159
H  15.506026 1.956184 4.078322
C  17.551656 2.268706 4.680173
H  18.106353 2.833802 5.450624
H  17.88672 2.672164 3.707528
C  17.909359 0.786105 4.772292
H  18.99239 0.621553 4.653448
H  17.610571 0.367226 5.747962
H  17.392749 0.204909 3.990051
totalener: -3625.86034153 hartree
nucrepener: 8842.99350254 hartree
cpcmener: -0.03163766 hartree
kineticenergy: 3528.92178195 hartree
exchangeener: -246.235697793120 hartree
correlationener: -17.465931370886 hartree
xcener: -263.701629164006 hartree
elementType: Ir C H O P N Fe
chargesum: -0.0000000
charge: -0.288704 0.100372 -0.581994 -0.072318 0.142953 -0.003651 0.014171 0.025975 0.044512 0.004460 0.004868 0.010689 0.000539 0.202372 -0.335983 -0.049348 -0.152807 -0.192192 -0.166625 -0.190033 -0.163445 0.103357 0.111684 0.091989 0.064595 0.085155 0.080090 0.027472 0.019690 0.049899 0.040123 0.040138 0.041593 0.020915 0.039886 0.030624 0.021768 0.032924 0.018129 0.026356 0.028604 0.435184 0.088407 -0.174290 0.186440 0.171863 0.078454 0.020906 0.064657 0.037410 0.045627 0.028863 -0.172194 0.050490 0.027501 -0.318056 -0.026556 0.040339 -0.001755 0.043776 0.009417 0.040717 0.038162 -0.158458 0.026812 0.044459 0.034795 0.029882 0.018741 0.026912 0.040107 0.029176 -0.190071 -0.013750 -0.019532 0.020512 -0.018803 0.028431 0.003208 0.017898 0.019279 0.010239 0.036528 -0.009123 -0.156145 0.078829 -0.024096 -0.027521 0.021674 -0.012936 -0.022116 0.024686 0.028299 0.027081 0.006720 -0.021458 0.012019 0.021976 -0.029377 0.008229 0.019225 -0.055706 0.013888 0.013814 -0.013674 0.024796 0.020042 0.020349
charge: -0.759953 0.044943 -0.154508 -0.019884 -0.015603 -0.029918 0.021240 0.022100 -0.028172 0.013500 0.019681 0.019019 0.023936 0.119979 -0.256244 -0.062507 -0.018107 -0.039238 -0.036786 -0.049128 -0.037810 -0.047513 -0.046812 -0.048184 -0.050657 -0.049417 0.039305 0.025689 0.029789 0.034119 0.029597 0.034841 0.033815 0.028988 0.034550 0.033763 0.028087 0.035311 0.027351 0.030862 0.032578 0.829754 0.062306 0.087676 0.107707 0.092699 0.044393 0.030784 -0.040030 0.031481 0.038055 0.031213 -0.030563 -0.010311 0.039037 -0.094948 -0.027970 0.035928 -0.030606 0.036487 -0.019062 0.037997 -0.013805 -0.170926 0.035730 -0.010161 0.039480 0.035981 -0.017935 -0.017131 0.038307 0.033694 -0.161913 -0.035549 -0.036690 0.034577 -0.026509 0.034134 -0.022204 0.034439 -0.016973 0.033657 0.033107 -0.026093 -0.159108 0.038455 -0.012773 -0.037446 0.035138 -0.026174 -0.036607 0.036001 0.036371 0.029219 0.022885 -0.031101 0.020778 0.018654 -0.037567 0.018293 0.018593 -0.040142 0.018988 0.019700 -0.060634 0.023375 0.021630 0.021623
qa: -0.2887 0.1004 -0.5820 -0.0723 0.1430 -0.0037 0.0142 0.0260 0.0445 0.0045 0.0049 0.0107 0.0005 0.2024 -0.3360 -0.0493 -0.1528 -0.1922 -0.1666 -0.1900 -0.1634 0.1034 0.1117 0.0920 0.0646 0.0852 0.0801 0.0275 0.0197 0.0499 0.0401 0.0401 0.0416 0.0209 0.0399 0.0306 0.0218 0.0329 0.0181 0.0264 0.0286 0.4352 0.0884 -0.1743 0.1864 0.1719 0.0785 0.0209 0.0647 0.0374 0.0456 0.0289 -0.1722 0.0505 0.0275 -0.3181 -0.0266 0.0403 -0.0018 0.0438 0.0094 0.0407 0.0382 -0.1585 0.0268 0.0445 0.0348 0.0299 0.0187 0.0269 0.0401 0.0292 -0.1901 -0.0137 -0.0195 0.0205 -0.0188 0.0284 0.0032 0.0179 0.0193 0.0102 0.0365 -0.0091 -0.1561 0.0788 -0.0241 -0.0275 0.0217 -0.0129 -0.0221 0.0247 0.0283 0.0271 0.0067 -0.0215 0.0120 0.0220 -0.0294 0.0082 0.0192 -0.0557 0.0139 0.0138 -0.0137 0.0248 0.0200 0.0203
va: 3.1883 3.8919 3.7584 4.0562 3.9571 4.0556 0.9878 0.9787 3.9760 0.9976 0.9798 0.9900 1.0055 3.9615 2.1745 3.8697 4.1153 4.0829 4.0536 4.0559 4.0880 3.9136 3.9548 3.9617 3.9524 3.9421 1.0343 0.9958 0.9937 0.9887 1.0171 0.9876 0.9880 1.0079 0.9882 0.9932 1.0057 0.9932 1.0069 0.9996 0.9914 3.9921 0.9781 3.3833 0.9389 0.9688 4.0987 0.9854 3.9331 0.9917 1.0258 0.9906 3.9121 3.8086 0.9981 5.5014 3.7862 1.0039 3.7708 0.9920 3.7835 0.9931 3.8364 3.7170 1.0105 3.7613 0.9940 1.0008 3.7910 3.7710 0.9935 0.9892 3.8497 3.9019 3.8406 0.9850 3.8417 0.9848 3.8757 0.9877 3.9190 1.0167 0.9918 3.9085 3.7992 0.9867 3.9220 3.8376 0.9858 3.8197 3.8574 0.9850 0.9843 1.0260 0.9730 3.9992 0.9840 0.9985 4.0238 0.9834 0.9826 4.0782 0.9792 0.9796 3.9967 0.9856 0.9896 0.9904
dispcorr: -0.352836904 hartree
energy: -3626.215834521352
dipole: -35.25401 32.48675 -2.76726 -33.50419 33.37177 -0.13242 -190.28369 191.92672 1.64303
magnitude: 3.22100 au
magnitude: 8.18712 debye
temp: 298.15 k
press: 1.00 atm
zeropoint: 0.93248436 hartree
thermalvibcorrection: 0.04809022 hartree
thermalrotcorrection: 0.00141627 hartree
thermaltrasncorrection: 0.00141627 hartree
thermaltotal: -3625.23242740 hartree
thermalcorr: 0.05092277 hartree
nonthermalcorr: 0.93248436 hartree
totalcorr: 0.98340712 hartree
thermalcorrenthalpy: 0.00094421 hartree
totalenthalpy: -3625.23148319 hartree
totalentropycorr: -0.12655747 hartree
gibbsenthalpy: -3625.35804066 hartree
gibbsminuselec: 0.85779386 hartree
