program: Orca
programVersion: 5.0.3
elementType: Ir C C C C C C H H H H H H C O C C C C C C C C C C C H H H H H H H H H H H H H H H H N H H C H C H H H C C H Fe C H C H C H C C H C H H C C H P H C C C H C H C H C H H C C H C C H C C H H H H C H H C H H C H H C H H H
elementType: Ir
charge: 0
multiplicity: 1
keywords: wB97X-D3BJ def2-QZVP def2/J SP VeryTightSCF defgrid3
formula: C46H57IrFeNOP
InChI: InChI=1/C22H33O.C19H19NP.C5H5.Fe.Ir/c1-7-8-10-19-11-9-12-20(13-19)22(23)21-17(5)15(3)14(2)16(4)18(21)6;1-15(20)18-13-8-14-19(18)21(16-9-4-2-5-10-16)17-11-6-3-7-12-17;1-2-4-5-3-1;;/h19H,7-13H2,1-6H3;2-15H,20H2,1H3;1-5H;;/rC46H57FeIrNOP/c1-8-9-17-31-18-16-23-44(24-31,43(50)34-28(5)26(3)25(2)27(4)29(34)6)48-49-30(7)45-41-40-42-46(45,47(40,41,42,45)35-36(47)38(47)39(47)37(35)47)51(48,32-19-12-10-13-20-32)33-21-14-11-15-22-33/h10-15,19-22,30-31,35-42H,8-9,16-18,23-24,49H2,1-7H3
108 atoms
Ir 12.977254 8.62828 4.14251
C  14.623389 7.555288 3.328437
C  13.754849 7.406101 2.077972
C  15.314542 6.309256 3.853102
C  13.326506 5.960881 1.776415
C  13.113294 5.212412 3.095902
C  14.416706 5.052948 3.886022
H  12.664604 4.222702 2.903636
H  12.397172 5.78818 3.704876
H  14.985545 4.197663 3.484834
H  14.170015 4.793767 4.923431
H  15.704597 6.518459 4.859417
H  16.201875 6.100183 3.228944
C  15.339703 8.817333 3.333389
O  14.866212 9.814207 2.725941
C  16.73852 8.897487 3.919236
C  17.778724 8.463951 3.069987
C  19.108233 8.498232 3.529747
C  19.38988 8.941334 4.837794
C  18.354918 9.431623 5.654779
C  17.021718 9.400835 5.198072
C  17.485179 7.971508 1.664975
C  20.244281 8.055108 2.630227
C  20.813071 8.897493 5.355678
C  18.67305 9.992665 7.026163
C  15.902837 9.902277 6.073878
H  16.41069 7.907207 1.460829
H  17.916908 6.973349 1.491705
H  17.920379 8.649134 0.912078
H  15.95213 9.478034 7.088327
H  14.93038 9.628836 5.644512
H  15.933563 10.999435 6.183318
H  18.793761 9.188705 7.773525
H  17.878892 10.657931 7.387148
H  19.608476 10.57054 7.016799
H  21.368157 8.048427 4.933829
H  20.843719 8.799294 6.448782
H  21.368511 9.814774 5.091115
H  19.960225 8.069109 1.571013
H  20.569595 7.027599 2.870373
H  21.122612 8.707038 2.74442
H  12.808708 8.02851 2.174944
N  11.108366 9.698086 4.015016
H  11.132435 10.24482 3.151535
H  11.010633 10.387762 4.761455
C  9.883712 8.862332 4.002806
H  9.021594 9.52141 3.80313
C  9.947674 7.811611 2.897811
H  10.1493 8.285062 1.923181
H  10.745144 7.08572 3.108436
H  8.984714 7.283135 2.833408
C  9.660334 8.252926 5.362128
C  8.377539 7.887693 5.871391
H  7.42898 8.022415 5.350498
Fe 9.234997 9.305588 7.054404
C  9.89058 11.252446 7.062532
H  10.754682 11.650913 6.533035
C  8.556801 11.174879 6.560247
H  8.227525 11.475492 5.565071
C  7.738918 10.59431 7.57631
H  6.676311 10.366119 7.4902
C  9.934774 7.44753 7.513031
C  10.638276 7.961655 6.374162
H  10.391036 7.152638 8.457303
C  8.548298 7.386038 7.196033
H  7.751737 7.062283 7.866002
H  10.773218 10.61161 9.027422
C  9.899185 10.71804 8.387535
C  8.568573 10.316312 8.705382
H  8.248031 9.839125 9.631775
P  12.448493 8.089349 6.1612
H  11.199481 5.383022 6.366908
C  13.031249 6.459964 6.776952
C  12.228027 5.314064 6.729275
C  12.733051 4.077345 7.14074
H  12.093923 3.19029 7.101087
C  14.048925 3.972881 7.597373
H  14.443861 3.005051 7.919982
C  14.861351 5.110899 7.635188
H  15.895503 5.036419 7.984208
C  14.355357 6.344549 7.225114
H  14.996675 7.230349 7.255503
H  12.76176 7.661949 9.130665
C  12.938292 8.718242 8.911186
C  12.884898 9.180631 7.589163
H  13.087704 10.889992 6.303221
C  13.118224 10.537018 7.33832
C  13.403897 11.419568 8.38128
H  13.586774 12.476686 8.16689
C  13.462385 10.949467 9.696095
C  13.226125 9.596702 9.959117
H  13.268499 9.222037 10.986179
H  13.692248 11.636171 10.516189
H  14.238118 7.88205 1.208355
H  12.364287 5.993067 1.234588
C  14.339024 5.247599 0.864339
H  15.355092 5.354201 1.281637
H  14.118457 4.16474 0.868556
C  14.342669 5.742299 -0.582119
H  13.339418 5.593121 -1.022535
H  14.527505 6.830867 -0.607599
C  15.388792 5.044669 -1.452586
H  16.388084 5.200908 -1.007306
H  15.212708 3.954058 -1.428965
C  15.389404 5.535209 -2.899649
H  16.152981 5.019103 -3.5036
H  14.409922 5.362582 -3.376591
H  15.596018 6.617565 -2.94947
elementType: Ir C H O N Fe P
totalener: -3628.32452073 hartree
nucrepener: 8809.69979776 hartree
cpcmener: -0.03802902 hartree
kineticenergy: 3546.88408138 hartree
exchangeener: -246.912770581523 hartree
correlationener: -17.449158214916 hartree
xcener: -264.361928796439 hartree
chargesum: 0.0000000
charge: 0.497256 -0.153199 0.088280 0.146760 0.107535 -0.055840 -0.053494 -0.014822 -0.004619 0.000491 -0.036574 -0.016379 -0.032014 -0.062937 -0.502617 0.188176 0.032573 -0.032165 -0.028958 -0.021159 -0.050518 -0.118450 -0.116662 -0.121500 -0.119999 -0.014013 0.007432 0.045227 0.034341 0.023555 0.012230 0.027045 0.049900 0.027628 0.032758 0.030892 0.028332 0.053952 0.029100 0.049410 0.033874 -0.004961 -0.311511 0.135385 0.184505 0.105225 -0.003030 -0.127728 0.058104 0.008980 0.035726 -0.227251 -0.301917 0.085526 2.206700 -0.268282 0.044132 -0.310845 0.069133 -0.237427 0.072248 -0.354399 0.053988 0.071607 -0.211065 0.082266 0.011060 -0.277197 -0.282854 0.084855 -0.421651 0.062532 0.394485 -0.125906 -0.166278 0.099900 -0.140462 0.093449 -0.173330 0.107188 -0.123910 0.047171 0.061240 -0.049140 0.207316 0.049165 0.037137 -0.161169 0.102023 -0.126692 -0.184726 0.097551 0.092495 -0.069992 -0.032001 -0.044776 0.015324 0.019512 -0.030854 0.015590 0.008618 -0.024701 0.013470 0.015274 -0.135551 0.031504 0.029236 0.029152
charge: 0.096426 -0.245841 0.090684 0.101876 -0.035483 0.104208 0.116662 -0.041490 -0.043824 -0.046184 -0.046250 -0.036164 -0.039437 -0.530544 0.258508 -0.060293 -0.072759 -0.078314 -0.077739 -0.077217 -0.080013 0.237326 0.232576 0.232320 0.231757 0.227748 -0.047728 -0.045253 -0.044287 -0.045340 -0.068547 -0.044536 -0.044957 -0.050698 -0.047702 -0.047986 -0.049315 -0.044084 -0.051837 -0.044597 -0.046551 -0.031758 0.652988 -0.120761 -0.126380 -0.120144 -0.010902 0.247776 -0.044682 -0.050958 -0.043911 -0.102382 0.108112 -0.024186 -0.448826 0.071536 -0.038258 0.081846 -0.033069 0.084233 -0.033448 0.074754 -0.148141 -0.027126 0.094590 -0.030652 -0.033186 0.082825 0.084549 -0.032869 0.466060 -0.040774 -0.163475 0.054065 0.057209 -0.050413 0.056538 -0.050738 0.058438 -0.049616 0.050057 -0.040452 -0.042058 0.055356 -0.156108 -0.043075 0.046283 0.061789 -0.049408 0.057792 0.058164 -0.050328 -0.050017 -0.031918 -0.027073 0.106247 -0.033002 -0.033218 0.084583 -0.041007 -0.043313 0.068139 -0.046160 -0.046218 0.207716 -0.061316 -0.057869 -0.057576
qa: 0.4973 -0.1532 0.0883 0.1468 0.1075 -0.0558 -0.0535 -0.0148 -0.0046 0.0005 -0.0366 -0.0164 -0.0320 -0.0629 -0.5026 0.1882 0.0326 -0.0322 -0.0290 -0.0212 -0.0505 -0.1185 -0.1167 -0.1215 -0.1200 -0.0140 0.0074 0.0452 0.0343 0.0236 0.0122 0.0270 0.0499 0.0276 0.0328 0.0309 0.0283 0.0540 0.0291 0.0494 0.0339 -0.0050 -0.3115 0.1354 0.1845 0.1052 -0.0030 -0.1277 0.0581 0.0090 0.0357 -0.2273 -0.3019 0.0855 2.2067 -0.2683 0.0441 -0.3108 0.0691 -0.2374 0.0722 -0.3544 0.0540 0.0716 -0.2111 0.0823 0.0111 -0.2772 -0.2829 0.0849 -0.4217 0.0625 0.3945 -0.1259 -0.1663 0.0999 -0.1405 0.0934 -0.1733 0.1072 -0.1239 0.0472 0.0612 -0.0491 0.2073 0.0492 0.0371 -0.1612 0.1020 -0.1267 -0.1847 0.0976 0.0925 -0.0700 -0.0320 -0.0448 0.0153 0.0195 -0.0309 0.0156 0.0086 -0.0247 0.0135 0.0153 -0.1356 0.0315 0.0292 0.0292
va: 3.4181 3.3138 3.8204 3.6096 3.5699 3.7844 3.7723 1.0192 1.0301 0.9977 1.0118 0.9808 1.0133 3.7970 1.9525 2.8180 3.2225 3.4283 3.4923 3.4018 3.1920 3.8279 3.8736 3.8757 3.8798 3.6877 1.0141 0.9874 1.0050 0.9641 1.0028 0.9860 1.0030 1.0058 0.9962 0.9988 1.0029 1.0021 1.0075 1.0015 0.9971 0.9949 3.1711 1.0091 0.9805 3.8866 1.0244 3.8746 0.9919 1.0280 1.0109 3.3904 3.8219 1.0081 1.8393 3.7778 1.0474 3.8537 1.0279 3.8445 1.0164 3.8335 3.0742 1.0179 3.7753 1.0114 1.0895 3.8302 3.8469 1.0154 4.6295 1.0206 3.0735 3.5330 3.7720 0.9796 3.7930 0.9858 3.7836 0.9757 3.5996 1.0329 1.0001 3.6173 3.3774 1.0133 3.5018 3.7912 0.9790 3.7833 3.7686 0.9801 0.9856 1.0365 1.0105 3.7330 0.9865 0.9999 3.7962 0.9955 1.0007 3.8343 0.9936 0.9978 3.9006 1.0061 1.0017 1.0018
dispcorr: -0.351783189 hartree
energy: -3628.676303922728
dipole: 107.85506 -110.74548 -2.89041 -87.62511 87.11096 -0.51415 82.96625 -81.77652 1.18973
magnitude: 3.16769 au
magnitude: 8.05164 debye
