program: Orca
programVersion: 5.0.3
elementType: Ir C C C C C C H H H H H H C O C C C C C C C C C C C H H H H H H H H H H H H H H H H N H H C H C H H H C C H Fe C H C H C H C C H C H H C C H P H C C C H C H C H C H H C C H C C H C C H H H H C H H C H H C H H C H H H
elementType: Ir
charge: 0
multiplicity: 1
keywords: wB97X-D3BJ def2-SVP def2/J OptTS TightOpt VeryTightSCF defgrid3 Freq
frequency: 0.00 0.00 0.00 0.00 0.00 0.00 -456.53 15.30 18.76 22.13 29.51 34.14 38.38 43.21 50.16 52.40 53.67 56.81 64.53 69.22 71.98 77.13 79.51 89.13 91.46 94.29 102.20 104.98 111.80 118.56 129.13 132.39 139.08 143.39 145.68 157.12 161.16 170.55 188.41 189.91 196.05 197.24 207.51 217.91 225.49 231.10 238.19 239.72 244.58 253.32 253.96 263.36 268.91 278.55 282.41 288.08 303.36 314.83 323.79 356.37 359.33 367.40 370.75 372.22 388.07 396.95 409.44 416.17 426.71 426.99 427.56 431.25 440.97 451.30 458.12 461.47 463.36 477.20 489.28 492.07 498.90 507.04 514.62 528.37 530.84 551.45 556.10 562.64 588.38 593.56 601.70 602.42 615.69 621.85 625.24 633.30 634.34 640.56 655.39 661.74 690.79 708.83 718.03 721.74 727.58 733.76 735.57 737.55 740.83 761.81 773.97 781.43 786.12 796.32 809.32 844.81 850.10 853.15 861.00 862.43 868.66 873.83 877.98 884.51 886.32 886.70 895.63 897.93 904.58 915.99 919.09 935.44 947.04 953.41 956.28 959.05 966.99 971.22 981.87 993.17 1000.85 1003.81 1006.93 1009.92 1025.29 1026.11 1027.31 1027.51 1029.53 1032.79 1036.73 1040.62 1044.53 1045.54 1052.72 1053.57 1054.18 1058.85 1060.67 1063.27 1063.63 1064.93 1065.44 1066.44 1067.75 1070.10 1086.17 1094.27 1099.56 1101.18 1103.60 1104.11 1108.94 1111.28 1111.51 1125.33 1138.01 1140.41 1150.95 1153.02 1161.37 1162.05 1162.96 1164.76 1176.61 1190.60 1194.06 1197.59 1208.52 1211.96 1215.57 1229.78 1237.91 1256.26 1265.01 1278.24 1278.74 1286.03 1301.86 1307.00 1308.25 1315.10 1321.48 1324.45 1326.62 1333.47 1347.41 1351.79 1365.94 1367.95 1371.00 1371.79 1383.05 1392.07 1394.16 1395.11 1396.38 1400.66 1403.97 1407.62 1409.07 1409.64 1418.41 1426.03 1430.51 1437.12 1440.14 1441.78 1443.74 1445.94 1447.32 1449.46 1451.07 1454.71 1457.09 1459.51 1461.57 1462.21 1463.54 1463.65 1465.14 1467.38 1472.10 1475.63 1476.55 1479.58 1481.26 1481.48 1483.31 1484.49 1484.91 1485.92 1487.52 1498.96 1515.46 1526.74 1532.84 1535.52 1555.15 1617.22 1672.47 1676.34 1679.01 1681.02 1693.93 1695.22 1734.18 2214.82 3048.55 3050.96 3052.93 3056.19 3060.15 3061.06 3065.58 3065.64 3066.03 3067.21 3068.83 3072.78 3076.47 3080.59 3091.00 3101.94 3112.87 3118.32 3126.28 3137.60 3141.12 3144.28 3144.84 3147.98 3151.68 3157.22 3158.62 3162.98 3179.44 3181.08 3184.30 3187.76 3194.01 3195.17 3201.31 3201.89 3205.38 3208.79 3212.03 3217.52 3219.81 3220.18 3225.60 3229.97 3232.57 3258.84 3260.10 3265.20 3270.85 3270.98 3276.32 3280.12 3282.83 3295.28 3544.32 3611.81
frequency: 15.30 18.76 22.13 29.51 34.14 38.38 43.21 50.16 52.40 53.67 56.81 64.53 69.22 71.98 77.13 79.51 89.13 91.46 94.29 102.20 104.98 111.80 118.56 129.13 132.39 139.08 143.39 145.68 157.12 161.16 170.55 188.41 189.91 196.05 197.24 207.51 217.91 225.49 231.10 238.19 239.72 244.58 253.32 253.96 263.36 268.91 278.55 282.41 288.08 303.36 314.83 323.79 356.37 359.33 367.40 370.75 372.22 388.07 396.95 409.44 416.17 426.71 426.99 427.56 431.25 440.97 451.30 458.12 461.47 463.36 477.20 489.28 492.07 498.90 507.04 514.62 528.37 530.84 551.45 556.10 562.64 588.38 593.56 601.70 602.42 615.69 621.85 625.24 633.30 634.34 640.56 655.39 661.74 690.79 708.83 718.03 721.74 727.58 733.76 735.57 737.55 740.83 761.81 773.97 781.43 786.12 796.32 809.32 844.81 850.10 853.15 861.00 862.43 868.66 873.83 877.98 884.51 886.32 886.70 895.63 897.93 904.58 915.99 919.09 935.44 947.04 953.41 956.28 959.05 966.99 971.22 981.87 993.17 1000.85 1003.81 1006.93 1009.92 1025.29 1026.11 1027.31 1027.51 1029.53 1032.79 1036.73 1040.62 1044.53 1045.54 1052.72 1053.57 1054.18 1058.85 1060.67 1063.27 1063.63 1064.93 1065.44 1066.44 1067.75 1070.10 1086.17 1094.27 1099.56 1101.18 1103.60 1104.11 1108.94 1111.28 1111.51 1125.33 1138.01 1140.41 1150.95 1153.02 1161.37 1162.05 1162.96 1164.76 1176.61 1190.60 1194.06 1197.59 1208.52 1211.96 1215.57 1229.78 1237.91 1256.26 1265.01 1278.24 1278.74 1286.03 1301.86 1307.00 1308.25 1315.10 1321.48 1324.45 1326.62 1333.47 1347.41 1351.79 1365.94 1367.95 1371.00 1371.79 1383.05 1392.07 1394.16 1395.11 1396.38 1400.66 1403.97 1407.62 1409.07 1409.64 1418.41 1426.03 1430.51 1437.12 1440.14 1441.78 1443.74 1445.94 1447.32 1449.46 1451.07 1454.71 1457.09 1459.51 1461.57 1462.21 1463.54 1463.65 1465.14 1467.38 1472.10 1475.63 1476.55 1479.58 1481.26 1481.48 1483.31 1484.49 1484.91 1485.92 1487.52 1498.96 1515.46 1526.74 1532.84 1535.52 1555.15 1617.22 1672.47 1676.34 1679.01 1681.02 1693.93 1695.22 1734.18 2214.82 3048.55 3050.96 3052.93 3056.19 3060.15 3061.06 3065.58 3065.64 3066.03 3067.21 3068.83 3072.78 3076.47 3080.59 3091.00 3101.94 3112.87 3118.32 3126.28 3137.60 3141.12 3144.28 3144.84 3147.98 3151.68 3157.22 3158.62 3162.98 3179.44 3181.08 3184.30 3187.76 3194.01 3195.17 3201.31 3201.89 3205.38 3208.79 3212.03 3217.52 3219.81 3220.18 3225.60 3229.97 3232.57 3258.84 3260.10 3265.20 3270.85 3270.98 3276.32 3280.12 3282.83 3295.28 3544.32 3611.81
formula: C46H57IrFeNOP
InChI: InChI=1/C22H32O.C19H19NP.C5H5.Fe.Ir.H/c1-7-8-10-19-11-9-12-20(13-19)22(23)21-17(5)15(3)14(2)16(4)18(21)6;1-15(20)18-13-8-14-19(18)21(16-9-4-2-5-10-16)17-11-6-3-7-12-17;1-2-4-5-3-1;;;/h13,19H,7-12H2,1-6H3;2-15H,20H2,1H3;1-5H;;;/rC46H57FeIrNOP/c1-8-9-17-30-18-16-23-44(43(50)33-27(5)25(3)24(2)26(4)28(33)6)42(30)48(44)49-29(7)45-40-39-41-46(45,47(39,40,41,45)34-35(47)37(47)38(47)36(34)47)51(48,31-19-12-10-13-20-31)32-21-14-11-15-22-32/h10-15,19-22,29-30,34-42,48H,8-9,16-18,23,49H2,1-7H3
108 atoms
Ir 12.75056 8.146589 3.685475
C  14.698917 7.397515 3.153585
C  13.834483 7.467228 1.969954
C  14.966719 6.0286 3.800394
C  13.41998 6.201447 1.210907
C  13.441333 4.966292 2.117447
C  14.776517 4.846136 2.847183
H  13.236535 4.065977 1.513588
H  12.632769 5.050488 2.862769
H  15.596263 4.793227 2.111951
H  14.814302 3.906837 3.425051
H  14.272379 5.878234 4.635482
H  15.967932 6.000823 4.249364
C  15.759769 8.4465 3.150306
O  15.706566 9.441956 2.429683
C  16.975877 8.309532 4.053496
C  17.964766 7.349182 3.770045
C  19.053154 7.199234 4.64847
C  19.156214 8.018717 5.792823
C  18.239328 9.068137 5.988365
C  17.144797 9.214637 5.112745
C  17.877805 6.510308 2.511648
C  20.118135 6.154451 4.384991
C  20.274789 7.766332 6.783508
C  18.390277 10.051854 7.130138
C  16.168935 10.3486 5.321171
H  16.984008 6.750615 1.9229
H  17.85238 5.432749 2.73517
H  18.752373 6.691019 1.866178
H  15.924991 10.494468 6.3825
H  15.230972 10.178234 4.78347
H  16.596269 11.297215 4.95346
H  17.651637 9.855736 7.927719
H  18.21824 11.081681 6.783618
H  19.388737 10.021031 7.58216
H  20.52308 6.697579 6.837457
H  20.002627 8.088605 7.796926
H  21.198653 8.301193 6.501039
H  20.073936 5.767311 3.360216
H  20.008676 5.293529 5.067111
H  21.127969 6.562631 4.54274
H  12.430284 8.186252 2.095966
N  10.647226 8.631391 3.904043
H  10.301041 8.842493 2.969694
H  10.515079 9.493666 4.43552
C  9.769397 7.595532 4.498521
H  8.720921 7.897821 4.334123
C  9.994882 6.239544 3.836336
H  9.875265 6.314909 2.743935
H  11.014944 5.888198 4.048864
H  9.265059 5.510798 4.220428
C  9.976953 7.536888 5.986844
C  8.97168 7.161937 6.927374
H  7.940066 6.908753 6.680899
Fe 9.629708 9.056768 7.298345
C  9.749889 10.950372 6.510034
H  10.369828 11.270815 5.673774
C  8.412265 10.457768 6.430364
H  7.838407 10.304144 5.515876
C  7.974441 10.162933 7.757026
H  7.009694 9.736765 8.033056
C  10.882929 7.668575 8.112909
C  11.174056 7.841745 6.719454
H  11.580009 7.840602 8.932108
C  9.532146 7.239802 8.237073
H  9.003618 7.052806 9.171859
H  11.116005 11.251591 8.268555
C  10.141197 10.956658 7.883768
C  9.041968 10.474363 8.653451
H  9.032823 10.327514 9.733692
P  12.79349 8.244166 5.99417
H  12.339689 5.472058 6.853068
C  13.865922 7.008692 6.817975
C  13.38856 5.711326 7.050353
C  14.250596 4.714975 7.513947
H  13.868042 3.705012 7.688325
C  15.598338 5.004225 7.747446
H  16.273586 4.221146 8.104646
C  16.077941 6.29773 7.524148
H  17.131173 6.537692 7.698704
C  15.21458 7.2924 7.062949
H  15.602266 8.294165 6.882305
H  13.742165 8.978068 8.75735
C  13.622468 9.891515 8.168997
C  13.209454 9.820523 6.832537
H  12.77399 10.933025 5.04325
C  13.072079 11.001789 6.094641
C  13.338427 12.240096 6.680553
H  13.2290 13.156682 6.093756
C  13.758537 12.304754 8.011932
C  13.900649 11.128627 8.755044
H  14.229908 11.174626 9.797205
H  13.978245 13.272837 8.47166
H  14.150958 8.262893 1.28784
H  12.388717 6.337716 0.84218
C  14.323815 6.021488 -0.024486
H  15.381706 6.145253 0.266559
H  14.226327 4.984245 -0.392217
C  14.004403 6.980315 -1.171972
H  12.961231 6.817908 -1.500588
H  14.051437 8.024567 -0.815332
C  14.942592 6.821896 -2.369047
H  15.982552 6.990205 -2.035913
H  14.902791 5.776462 -2.724835
C  14.611813 7.770465 -3.520361
H  15.303434 7.637793 -4.367861
H  13.587442 7.599752 -3.892111
H  14.675224 8.822697 -3.195669
totalener: -3625.85599008 hartree
nucrepener: 8857.14480641 hartree
cpcmener: -0.03685009 hartree
kineticenergy: 3528.88817702 hartree
exchangeener: -246.207831034339 hartree
correlationener: -17.462908720792 hartree
xcener: -263.670739755131 hartree
temp: 298.15 k
press: 1.00 atm
thermalcorrenthalpy: 0.00094421 hartree
totalenthalpy: -3625.22701391 hartree
totalentropycorr: -0.12675183 hartree
gibbsenthalpy: -3625.35376574 hartree
gibbsminuselec: 0.85403601 hartree
elementType: Ir C H O N Fe P
chargesum: -0.0000000
charge: -0.311331 -0.479622 -0.071734 0.182049 -0.013775 0.055996 -0.007901 0.002984 0.007885 0.002423 0.001760 0.015006 0.003536 0.198829 -0.320709 -0.053044 -0.160572 -0.184659 -0.153681 -0.186094 -0.184510 0.086351 0.071656 0.063874 0.080443 0.108459 0.039607 0.045577 0.046485 0.032857 0.051102 0.032333 0.036778 0.033232 0.028135 0.028480 0.036338 0.044831 0.024430 0.044638 0.032813 0.018422 -0.171342 0.191871 0.166284 0.082762 0.028752 0.062495 0.039638 0.072712 0.025016 -0.163991 0.049744 0.029105 -0.314677 -0.029764 0.040493 0.018378 0.039697 0.009045 0.040998 0.030979 -0.168004 0.028686 0.048749 0.035615 0.022516 0.015221 0.025690 0.040251 0.438985 0.032582 -0.173372 -0.001210 -0.020299 0.025541 -0.016441 0.027858 -0.022283 0.025247 0.019548 0.010477 0.037114 -0.011837 -0.163872 0.058577 -0.004661 -0.022178 0.024922 -0.010699 -0.021957 0.026598 0.030719 0.038934 0.006244 0.008282 0.015884 0.004125 -0.034424 0.006327 0.014788 -0.053335 0.014435 0.012713 -0.015394 0.024371 0.019892 0.021201
charge: -0.764405 -0.143970 0.042603 -0.013526 -0.020450 -0.024503 -0.030349 0.016438 0.024674 0.012441 0.017689 0.028818 0.020866 0.122264 -0.244514 -0.063218 -0.035255 -0.044941 -0.035755 -0.044920 -0.027277 -0.048075 -0.048919 -0.050083 -0.048698 -0.048947 0.029637 0.034212 0.036924 0.026153 0.033091 0.036634 0.034186 0.033870 0.028882 0.031500 0.030269 0.037559 0.029904 0.036798 0.032376 0.009432 0.094409 0.109040 0.091112 0.046629 0.032182 -0.038312 0.031800 0.038325 0.030305 -0.028899 -0.009084 0.039618 -0.093811 -0.030946 0.032934 -0.022581 0.037435 -0.018310 0.038028 -0.013395 -0.174894 0.036936 -0.008732 0.040045 0.035434 -0.018656 -0.017163 0.038350 0.818202 0.035878 -0.163490 -0.027845 -0.032932 0.036573 -0.027226 0.036487 -0.028486 0.035824 -0.018949 0.033680 0.033590 -0.024891 -0.166952 0.040823 -0.009861 -0.032477 0.037202 -0.023554 -0.034704 0.037257 0.037697 0.026220 0.022750 -0.027950 0.018778 0.019363 -0.036487 0.017377 0.018295 -0.041192 0.019474 0.018478 -0.060667 0.023118 0.021445 0.021943
qa: -0.3113 -0.4796 -0.0717 0.1820 -0.0138 0.0560 -0.0079 0.0030 0.0079 0.0024 0.0018 0.0150 0.0035 0.1988 -0.3207 -0.0530 -0.1606 -0.1847 -0.1537 -0.1861 -0.1845 0.0864 0.0717 0.0639 0.0804 0.1085 0.0396 0.0456 0.0465 0.0329 0.0511 0.0323 0.0368 0.0332 0.0281 0.0285 0.0363 0.0448 0.0244 0.0446 0.0328 0.0184 -0.1713 0.1919 0.1663 0.0828 0.0288 0.0625 0.0396 0.0727 0.0250 -0.1640 0.0497 0.0291 -0.3147 -0.0298 0.0405 0.0184 0.0397 0.0090 0.0410 0.0310 -0.1680 0.0287 0.0487 0.0356 0.0225 0.0152 0.0257 0.0403 0.4390 0.0326 -0.1734 -0.0012 -0.0203 0.0255 -0.0164 0.0279 -0.0223 0.0252 0.0195 0.0105 0.0371 -0.0118 -0.1639 0.0586 -0.0047 -0.0222 0.0249 -0.0107 -0.0220 0.0266 0.0307 0.0389 0.0062 0.0083 0.0159 0.0041 -0.0344 0.0063 0.0148 -0.0533 0.0144 0.0127 -0.0154 0.0244 0.0199 0.0212
va: 3.3277 3.7913 3.8918 3.9251 3.9874 3.9881 4.0620 0.9823 1.0008 0.9984 0.9785 0.9997 0.9948 3.9979 2.1874 3.8609 4.0913 4.0659 4.0412 4.0569 4.1230 3.9432 3.9569 3.9585 3.9583 3.9216 1.0166 0.9896 0.9875 0.9961 1.0313 0.9945 0.9948 0.9954 0.9979 0.9989 0.9922 0.9894 1.0062 0.9897 0.9920 0.9980 3.3949 0.9345 0.9759 4.0891 0.9839 3.9286 0.9909 1.0124 0.9915 3.8853 3.8085 0.9978 5.4924 3.7846 1.0036 3.7664 0.9922 3.7797 0.9931 3.8559 3.7223 1.0072 3.7617 0.9937 1.0063 3.7935 3.7743 0.9932 3.8063 0.9903 3.8234 3.9072 3.8543 0.9848 3.8224 0.9843 3.8762 0.9878 3.9203 1.0107 0.9963 3.9105 3.8097 0.9944 3.9236 3.8522 0.9857 3.8201 3.8637 0.9853 0.9844 1.0140 0.9770 3.9834 1.0007 0.9882 4.0275 0.9833 0.9911 4.0727 0.9802 0.9787 3.9974 0.9855 0.9895 0.9904
dispcorr: -0.351834939 hartree
energy: -3626.207923855921
dipole: 161.22414 -164.10698 -2.88284 -24.38197 23.58972 -0.79225 135.79602 -133.13111 2.66491
magnitude: 4.00502 au
magnitude: 10.17995 debye
zeropoint: 0.92897914 hartree
thermalvibcorrection: 0.04815557 hartree
thermalrotcorrection: 0.00141627 hartree
thermaltrasncorrection: 0.00141627 hartree
thermaltotal: -3625.22795661 hartree
thermalcorr: 0.05098811 hartree
nonthermalcorr: 0.92897914 hartree
totalcorr: 0.97996725 hartree
totalenthalpy: -3625.22701240 hartree
