program: Orca
programVersion: 5.0.3
elementType: Ir C C C C C C H H H H H H C O C C C C C C C C C C C H H H H H H H H H H H H H H H H N H H C H C H H H C C H Fe C H C H C H C C H C H H C C H P H C C C H C H C H C H H C C H C C H C C H H H H C H H C H H C H H C H H H
elementType: Ir
charge: 0
multiplicity: 1
keywords: b97-3c Opt TightSCF defgrid2
formula: C46H57IrFeNOP
InChI: InChI=1S/C22H32O.C19H19NP.C5H5.Fe.Ir.H/c1-7-8-10-19-11-9-12-20(13-19)22(23)21-17(5)15(3)14(2)16(4)18(21)6;1-15(20)18-13-8-14-19(18)21(16-9-4-2-5-10-16)17-11-6-3-7-12-17;1-2-4-5-3-1;;;/h13,19H,7-12H2,1-6H3;2-15H,20H2,1H3;1-5H;;;
108 atoms
Ir 12.703788 8.099061 3.746969
C  14.660082 7.385179 3.142805
C  13.79475 7.465192 1.974629
C  14.916877 6.018294 3.776695
C  13.42219 6.224953 1.179974
C  13.428774 4.977358 2.052492
C  14.72836 4.846069 2.824259
H  13.255332 4.095329 1.431707
H  12.602102 5.040153 2.761889
H  15.563317 4.768607 2.127616
H  14.730092 3.918955 3.401433
H  14.224645 5.868627 4.598664
H  15.904282 5.987211 4.226428
C  15.73202 8.423878 3.137172
O  15.69848 9.405075 2.393977
C  16.935627 8.280519 4.036866
C  17.911896 7.319096 3.755123
C  18.995241 7.161125 4.626364
C  19.107138 7.978897 5.75874
C  18.215703 9.0415 5.940775
C  17.124471 9.193988 5.076647
C  17.833686 6.515253 2.488309
C  20.042781 6.116455 4.360323
C  20.206931 7.730683 6.753527
C  18.412612 10.031404 7.054096
C  16.181774 10.341856 5.258039
H  16.948168 6.758636 1.913716
H  17.827205 5.441577 2.671042
H  18.688583 6.728273 1.845442
H  15.947832 10.528859 6.302074
H  15.25109 10.182485 4.730527
H  16.615347 11.260101 4.856613
H  17.78062 9.809295 7.918825
H  18.155565 11.03771 6.733782
H  19.439801 10.060574 7.402767
H  20.501125 6.685411 6.773499
H  19.904065 7.99472 7.763137
H  21.106847 8.308978 6.527828
H  20.010889 5.754049 3.339121
H  19.918709 5.245211 5.008505
H  21.047217 6.498075 4.534309
H  12.364381 8.092761 2.148356
N  10.575514 8.460295 3.9489
H  10.233905 8.582305 3.006824
H  10.408833 9.337909 4.429773
C  9.750513 7.425841 4.627532
H  8.695773 7.661918 4.450637
C  10.040485 6.04697 4.065632
H  9.878847 6.019092 2.988581
H  11.079165 5.790555 4.254365
H  9.386332 5.311857 4.531831
C  9.975409 7.498803 6.097309
C  8.996935 7.180338 7.080154
H  7.977895 6.89173 6.878638
Fe 9.620598 9.089262 7.288221
C  9.808938 10.959061 6.481459
H  10.503357 11.26261 5.71785
C  8.493283 10.460858 6.28307
H  8.005717 10.303589 5.334647
C  7.934055 10.185405 7.560156
H  6.9596 9.766147 7.747735
C  10.909289 7.812215 8.177893
C  11.178959 7.877858 6.77814
H  11.604347 8.065961 8.958334
C  9.574611 7.372002 8.362515
H  9.06953 7.257869 9.307129
H  10.993162 11.284925 8.338315
C  10.067321 10.988129 7.878398
C  8.905664 10.516217 8.544491
H  8.794421 10.387412 9.608075
P  12.7924 8.232811 5.99705
H  12.313246 5.510072 6.973469
C  13.85561 6.998919 6.835502
C  13.362051 5.727482 7.122173
C  14.211552 4.733627 7.584879
H  13.815968 3.750386 7.80382
C  15.564584 4.994446 7.756661
H  16.228431 4.213965 8.104821
C  16.061459 6.258396 7.471077
H  17.116028 6.472878 7.578625
C  15.211713 7.253714 7.017339
H  15.617798 8.221679 6.777112
H  13.78486 9.004232 8.729567
C  13.657595 9.90352 8.143404
C  13.239922 9.817295 6.818399
H  12.861653 10.896749 5.019598
C  13.125091 10.983345 6.067552
C  13.397886 12.217832 6.634804
H  13.313231 13.115808 6.03731
C  13.807703 12.298193 7.958981
C  13.942851 11.137778 8.70988
H  14.2755 11.193779 9.738185
H  14.034423 13.25962 8.4008
H  14.057356 8.303665 1.343062
H  12.410433 6.358078 0.785408
C  14.363644 6.092836 -0.025506
H  15.395126 6.246389 0.297549
H  14.316045 5.067235 -0.400643
C  14.049006 7.048828 -1.164801
H  13.058895 6.81311 -1.565972
H  13.984203 8.072408 -0.787716
C  15.073371 7.007675 -2.287789
H  16.055181 7.269029 -1.884468
H  15.161579 5.981659 -2.655956
C  14.733444 7.935061 -3.442716
H  15.484425 7.886887 -4.231118
H  13.771301 7.674181 -3.885206
H  14.670559 8.971495 -3.108556
totalener: -3625.61337877 hartree
nucrepener: 8861.10832592 hartree
cpcmener: -0.03808302 hartree
kineticenergy: 3547.69818423 hartree
xcener: -375.494041167701 hartree
elementType: Ir C H O N Fe P
chargesum: -0.0000000
charge: -0.540390 0.137319 -0.758116 -0.132188 0.172975 -0.219609 -0.381240 0.177918 0.137647 0.185954 0.173257 0.158830 0.185841 -0.215148 -0.413574 0.461760 -0.076626 0.302409 0.112436 0.262774 -0.121971 -0.728003 -0.796172 -0.750180 -0.782194 -0.604213 0.216872 0.208094 0.204889 0.180002 0.210314 0.193929 0.204411 0.207694 0.210114 0.205712 0.205018 0.208415 0.218332 0.204172 0.201691 0.086758 -0.816223 0.408915 0.346844 -0.016882 0.206477 -0.511690 0.183451 0.194763 0.177777 0.143718 -0.161746 0.209013 -0.283894 -0.220506 0.230795 -0.136489 0.213565 -0.194422 0.204212 -0.091621 -0.291261 0.209392 -0.176256 0.204757 0.170219 -0.141956 -0.165097 0.210416 0.593426 0.197410 -0.192683 -0.093393 -0.192966 0.185679 -0.195989 0.185778 -0.241403 0.183642 0.003013 0.121951 0.226351 -0.091428 -0.229550 0.227230 -0.187916 -0.157319 0.187429 -0.203675 -0.217842 0.187121 0.184761 0.249945 0.175775 -0.388627 0.147737 0.171922 -0.401385 0.155668 0.163260 -0.283551 0.158738 0.153417 -0.508066 0.176203 0.162489 0.164662
charge: -0.567245 -0.152968 -0.171145 -0.271027 -0.195278 -0.286178 -0.288017 0.152851 0.161489 0.151906 0.151875 0.175976 0.172551 0.246690 -0.617502 -0.039686 -0.069788 -0.080115 -0.074702 -0.082541 -0.061262 -0.411604 -0.415237 -0.418531 -0.414936 -0.405508 0.170924 0.169565 0.170276 0.169134 0.184185 0.169995 0.168472 0.169551 0.166278 0.168006 0.167207 0.171002 0.167641 0.169843 0.167647 0.118157 -0.364838 0.304915 0.293176 -0.105395 0.169697 -0.417264 0.162271 0.173482 0.163459 -0.073726 -0.143812 0.182630 -0.061829 -0.175377 0.179669 -0.168227 0.178382 -0.157695 0.178638 -0.153943 -0.265411 0.181355 -0.146597 0.180485 0.184058 -0.160312 -0.156879 0.178849 1.042241 0.180964 -0.267843 -0.169773 -0.170360 0.173306 -0.167099 0.172990 -0.164840 0.176599 -0.160745 0.186293 0.177832 -0.170257 -0.269191 0.179109 -0.175078 -0.169048 0.174155 -0.166464 -0.173294 0.173806 0.173612 0.199619 0.160490 -0.290518 0.158522 0.158258 -0.302664 0.151477 0.153651 -0.310690 0.150491 0.149478 -0.437453 0.152271 0.150925 0.151516
qa: -0.5404 0.1373 -0.7581 -0.1322 0.1730 -0.2196 -0.3812 0.1779 0.1376 0.1860 0.1733 0.1588 0.1858 -0.2151 -0.4136 0.4618 -0.0766 0.3024 0.1124 0.2628 -0.1220 -0.7280 -0.7962 -0.7502 -0.7822 -0.6042 0.2169 0.2081 0.2049 0.1800 0.2103 0.1939 0.2044 0.2077 0.2101 0.2057 0.2050 0.2084 0.2183 0.2042 0.2017 0.0868 -0.8162 0.4089 0.3468 -0.0169 0.2065 -0.5117 0.1835 0.1948 0.1778 0.1437 -0.1617 0.2090 -0.2839 -0.2205 0.2308 -0.1365 0.2136 -0.1944 0.2042 -0.0916 -0.2913 0.2094 -0.1763 0.2048 0.1702 -0.1420 -0.1651 0.2104 0.5934 0.1974 -0.1927 -0.0934 -0.1930 0.1857 -0.1960 0.1858 -0.2414 0.1836 0.0030 0.1220 0.2264 -0.0914 -0.2296 0.2272 -0.1879 -0.1573 0.1874 -0.2037 -0.2178 0.1871 0.1848 0.2499 0.1758 -0.3886 0.1477 0.1719 -0.4014 0.1557 0.1633 -0.2836 0.1587 0.1534 -0.5081 0.1762 0.1625 0.1647
va: 3.9533 3.2196 3.6014 3.4963 3.1930 3.5525 3.7697 0.9423 0.9830 0.9278 0.9400 0.9634 0.9429 3.6613 2.0835 3.1891 3.5525 3.0889 3.4379 3.1164 3.5254 3.7892 3.7158 3.7282 3.7372 3.5992 0.9374 0.9183 0.9234 0.9509 0.9548 0.9289 0.9239 0.9288 0.9259 0.9338 0.9263 0.9225 0.9300 0.9245 0.9236 0.9484 2.8000 0.8028 0.8898 3.5797 0.9273 3.7379 0.9470 0.9498 0.9449 3.7117 4.0350 0.9091 5.4490 4.0963 0.9038 4.0415 0.9120 4.0942 0.9179 3.9194 3.9731 0.9140 4.1057 0.9151 0.9414 4.0929 4.0829 0.9144 4.1280 0.9422 3.5310 3.7731 3.9407 0.9348 3.8601 0.9363 4.0336 0.9360 3.8087 0.9432 0.9116 3.7887 3.6963 0.9148 3.8299 3.9621 0.9366 3.9207 3.9799 0.9384 0.9394 0.9217 0.9456 3.6462 0.9572 0.9496 3.7190 0.9508 0.9539 3.6947 0.9472 0.9474 3.7735 0.9434 0.9501 0.9499
dispcorr: -0.400160028 hartree
energy: -3626.359352361284
dipole: 167.18934 -170.17180 -2.98245 -18.27293 17.15543 -1.11750 127.78750 -125.43115 2.35635
magnitude: 3.96184 au
magnitude: 10.07021 debye
