program: Orca
programVersion: 5.0.3
elementType: Ir C C C C C H C H H H H H H C O C C C C C C C C C C C H H H H H H H H H H H H H H H H N H H C H C H H H C C H Fe C H C H C H C C H C H H C C H P H C C C H C H C H C H H C C H C C H C C H H H C H H C H H C H H C H H H
elementType: Ir
charge: 0
multiplicity: 1
keywords: b97-3c Opt TightSCF defgrid2
formula: C46H57IrFeNOP
InChI: InChI=1S/C22H32O.C19H19NP.C5H5.Fe.Ir.H/c1-7-8-10-19-11-9-12-20(13-19)22(23)21-17(5)15(3)14(2)16(4)18(21)6;1-15(20)18-13-8-14-19(18)21(16-9-4-2-5-10-16)17-11-6-3-7-12-17;1-2-4-5-3-1;;;/h13,19H,7-12H2,1-6H3;2-15H,20H2,1H3;1-5H;;;
108 atoms
Ir 12.448806 7.850977 4.122717
C  14.504333 7.457646 3.621787
C  13.717614 7.639403 2.389812
C  14.875588 6.037215 4.044875
C  13.526929 6.495264 1.409062
C  13.578592 5.144154 2.100231
H  14.390213 6.544051 0.732033
C  14.84606 5.013032 2.92146
H  13.51474 4.350247 1.352359
H  12.707145 5.047142 2.754985
H  15.712771 5.139799 2.269386
H  14.925267 4.010554 3.346752
H  14.175412 5.706182 4.80989
H  15.857454 6.033644 4.514706
C  15.540473 8.524302 3.778116
O  15.317552 9.71312 3.573207
C  16.962515 8.096377 4.079609
C  17.734778 7.579518 3.032423
C  19.027373 7.113137 3.29716
C  19.537344 7.167245 4.600472
C  18.806697 7.800258 5.610826
C  17.510256 8.263266 5.352893
C  17.210019 7.581169 1.623599
C  19.875181 6.549292 2.191355
C  20.883399 6.57201 4.905691
C  19.410773 7.991743 6.973481
C  16.736281 8.9653 6.425999
H  16.199229 7.962753 1.567348
H  17.215805 6.588918 1.174417
H  17.819031 8.223662 0.986096
H  16.762645 8.438108 7.377365
H  15.700724 9.10524 6.151121
H  17.138257 9.9638 6.606578
H  19.217649 7.138819 7.630099
H  19.006356 8.868414 7.469577
H  20.488557 8.119542 6.92491
H  21.121613 5.75078 4.236597
H  20.928532 6.181441 5.918673
H  21.688985 7.305242 4.810372
H  19.518168 6.84352 1.210832
H  19.887517 5.456573 2.209036
H  20.909476 6.878549 2.267402
H  12.278806 8.127259 2.516447
N  10.285728 7.841751 4.082339
H  10.056348 7.450895 3.177916
H  9.985576 8.809267 4.070025
C  9.469862 7.143329 5.107881
H  8.421408 7.192494 4.79437
C  9.880769 5.684694 5.199657
H  9.724853 5.176498 4.247881
H  10.934933 5.603786 5.451191
H  9.289915 5.176129 5.958911
C  9.569089 7.857843 6.410531
C  8.475106 8.160849 7.269789
H  7.436826 7.967009 7.053684
Fe 9.479275 9.848388 6.757336
C  10.255727 11.110321 5.35568
H  11.092122 10.862329 4.722929
C  8.885443 10.850701 5.078181
H  8.481156 10.425853 4.172939
C  8.120758 11.258137 6.205094
H  7.05301 11.165439 6.313619
C  10.39193 8.910938 8.287631
C  10.767969 8.317936 7.044299
H  11.063011 9.394029 8.97518
C  8.983684 8.808621 8.425919
H  8.39801 9.202338 9.239861
H  11.247019 11.956086 7.159987
C  10.337561 11.684774 6.653062
C  9.019141 11.779237 7.175144
H  8.750563 12.141015 8.153567
P  12.428508 8.095252 6.348084
H  11.175631 6.183679 8.275192
C  13.063721 6.732004 7.410686
C  12.229143 5.952966 8.209212
C  12.742626 4.88548 8.933604
H  12.081646 4.290531 9.550586
C  14.095575 4.584898 8.874012
H  14.494552 3.753578 9.440383
C  14.933848 5.357815 8.080649
H  15.990508 5.131288 8.021051
C  14.420325 6.416525 7.351242
H  15.077286 6.999694 6.727193
H  13.4650 8.86881 9.030952
C  13.657557 9.684843 8.347213
C  13.308749 9.563258 7.004162
H  13.412995 10.449926 5.066362
C  13.616072 10.592558 6.119437
C  14.23581 11.744805 6.578204
H  14.485705 12.530886 5.878638
C  14.561272 11.872988 7.92141
C  14.279554 10.837165 8.803746
H  14.55411 10.923687 9.847115
H  15.053226 12.768573 8.27866
H  13.960532 8.57213 1.891864
C  12.278334 6.640657 0.546715
H  12.230975 5.78015 -0.126251
H  11.398037 6.571757 1.193206
C  12.206965 7.916112 -0.275483
H  13.109979 8.003242 -0.887447
H  12.204511 8.786034 0.38571
C  10.98039 7.983648 -1.17206
H  10.982478 7.126133 -1.850416
H  10.083192 7.87889 -0.555678
C  10.89787 9.270664 -1.975844
H  10.010919 9.293293 -2.608918
H  10.859419 10.141253 -1.319718
H  11.769061 9.385819 -2.622073
totalener: -3625.61961533 hartree
nucrepener: 8847.59710288 hartree
cpcmener: -0.03350197 hartree
kineticenergy: 3547.67935407 hartree
xcener: -375.490453588650 hartree
elementType: Ir C H O N Fe P
chargesum: -0.0000000
charge: -0.478143 0.603042 -0.939607 -0.376288 0.076154 -0.294250 0.156402 -0.224382 0.177905 0.147181 0.133221 0.170492 0.214553 0.191404 -0.445138 -0.382369 0.173623 0.165779 0.155622 0.234488 0.130788 0.277155 -0.719933 -0.773121 -0.757752 -0.759861 -0.814653 0.237425 0.204543 0.195015 0.214609 0.259530 0.205447 0.203322 0.210672 0.203951 0.206535 0.205816 0.207533 0.215329 0.204759 0.201990 0.078591 -0.800384 0.397138 0.337880 -0.042175 0.203084 -0.514225 0.185495 0.192950 0.176993 0.160643 -0.148314 0.211154 -0.311679 -0.226680 0.189299 -0.162789 0.230528 -0.195861 0.206508 -0.064882 -0.243105 0.204465 -0.204199 0.202248 0.194972 -0.115746 -0.170664 0.209290 0.459631 0.189638 -0.282813 -0.034993 -0.208045 0.186562 -0.189599 0.185183 -0.209965 0.189863 -0.023971 0.141270 0.211575 -0.069037 -0.347473 0.181795 -0.044725 -0.194478 0.188920 -0.200833 -0.189402 0.186686 0.183332 0.309916 -0.319968 0.159951 0.151830 -0.364324 0.156894 0.172039 -0.280374 0.154765 0.151163 -0.503841 0.176574 0.163522 0.163409
charge: -0.565538 -0.156670 -0.190760 -0.276186 -0.195954 -0.285364 0.165232 -0.284637 0.154340 0.163023 0.153551 0.151990 0.171937 0.169468 0.247045 -0.587965 -0.045792 -0.063455 -0.078169 -0.074919 -0.078095 -0.063515 -0.410307 -0.415511 -0.417128 -0.415504 -0.412552 0.176139 0.166021 0.169708 0.166095 0.179799 0.171765 0.170224 0.168827 0.167229 0.167850 0.167943 0.170984 0.167722 0.170562 0.167842 0.132813 -0.365749 0.300428 0.293390 -0.105968 0.169232 -0.418029 0.161398 0.171456 0.165286 -0.076256 -0.146375 0.182004 -0.064448 -0.171328 0.181717 -0.178729 0.177316 -0.161385 0.178653 -0.154259 -0.264909 0.183655 -0.148867 0.180276 0.182748 -0.158216 -0.157768 0.178827 1.041808 0.182399 -0.266047 -0.171227 -0.170842 0.173005 -0.169402 0.172958 -0.168158 0.173698 -0.166809 0.181410 0.178508 -0.167519 -0.270208 0.194320 -0.161947 -0.169973 0.173629 -0.163456 -0.170619 0.173158 0.172839 0.191433 -0.294152 0.157248 0.158082 -0.304717 0.153395 0.154961 -0.309337 0.150012 0.149542 -0.437419 0.152272 0.151390 0.151577
qa: -0.4781 0.6030 -0.9396 -0.3763 0.0762 -0.2943 0.1564 -0.2244 0.1779 0.1472 0.1332 0.1705 0.2146 0.1914 -0.4451 -0.3824 0.1736 0.1658 0.1556 0.2345 0.1308 0.2772 -0.7199 -0.7731 -0.7578 -0.7599 -0.8147 0.2374 0.2045 0.1950 0.2146 0.2595 0.2054 0.2033 0.2107 0.2040 0.2065 0.2058 0.2075 0.2153 0.2048 0.2020 0.0786 -0.8004 0.3971 0.3379 -0.0422 0.2031 -0.5142 0.1855 0.1930 0.1770 0.1606 -0.1483 0.2112 -0.3117 -0.2267 0.1893 -0.1628 0.2305 -0.1959 0.2065 -0.0649 -0.2431 0.2045 -0.2042 0.2022 0.1950 -0.1157 -0.1707 0.2093 0.4596 0.1896 -0.2828 -0.0350 -0.2080 0.1866 -0.1896 0.1852 -0.2100 0.1899 -0.0240 0.1413 0.2116 -0.0690 -0.3475 0.1818 -0.0447 -0.1945 0.1889 -0.2008 -0.1894 0.1867 0.1833 0.3099 -0.3200 0.1600 0.1518 -0.3643 0.1569 0.1720 -0.2804 0.1548 0.1512 -0.5038 0.1766 0.1635 0.1634
va: 3.9866 2.5232 3.5663 3.6698 3.3949 3.5910 0.9588 3.7933 0.9354 0.9750 0.9626 0.9443 0.9277 0.9374 3.8480 2.0740 3.3882 3.3464 3.3215 3.2129 3.2562 3.1710 3.7014 3.7190 3.7354 3.7284 3.7402 0.9451 0.9204 0.9287 0.9276 0.8176 0.9234 0.9250 0.9301 0.9255 0.9309 0.9276 0.9232 0.9305 0.9254 0.9236 0.9714 2.7607 0.8162 0.8938 3.5903 0.9288 3.7377 0.9440 0.9548 0.9522 3.7654 4.0393 0.9078 5.4623 4.1933 0.9548 4.0149 0.9002 4.0898 0.9165 3.9057 3.9285 0.9288 4.1258 0.9165 0.9327 4.0339 4.0883 0.9164 4.2228 0.9485 3.5502 3.7290 3.9088 0.9349 3.8825 0.9366 3.9551 0.9313 3.9279 0.9311 0.9185 3.6871 3.7829 0.9606 3.7883 3.9842 0.9353 3.9259 3.9426 0.9358 0.9388 0.8574 3.5168 0.9586 0.9670 3.6711 0.9507 0.9481 3.6920 0.9478 0.9481 3.7666 0.9435 0.9505 0.9506
dispcorr: -0.395596812 hartree
energy: -3626.361259994496
dipole: 148.94494 -151.49185 -2.54691 18.64023 -19.99337 -1.35314 85.10663 -84.16448 0.94215
magnitude: 3.03404 au
magnitude: 7.71191 debye
