program: Orca
programVersion: 5.0.3
elementType: Ir C C C C C H H C H H H H H C O C C C C C C C C C C C H H H H H H H H H H H H H H H P H N H H C H C H H H C C H Fe C H C H C H C C H C H H C C H H C C C H C H C H C H H C C H C C H C C H H H C H H H
elementType: Ir
charge: 0
multiplicity: 1
keywords: wB97X-D3BJ def2-QZVP def2/J SP VeryTightSCF defgrid3
formula: C43H51IrFeNOP
InChI: InChI=1/C19H19NP.C19H26O.C5H5.Fe.Ir.H/c1-15(20)18-13-8-14-19(18)21(16-9-4-2-5-10-16)17-11-6-3-7-12-17;1-11-8-7-9-17(10-11)19(20)18-15(5)13(3)12(2)14(4)16(18)6;1-2-4-5-3-1;;;/h2-15H,20H2,1H3;10-11H,7-9H2,1-6H3;1-5H;;;/rC43H51FeIrNOP/c1-21-15-14-20-41(40(47)30-25(5)23(3)22(2)24(4)26(30)6)39(21)45(41)46-27(7)42-37-36-38-43(42,44(36,37,38,42)31-32(44)34(44)35(44)33(31)44)48(45,28-16-10-8-11-17-28)29-18-12-9-13-19-29/h8-13,16-19,21,27,31-39,45H,14-15,20,46H2,1-7H3
99 atoms
Ir 12.633777 6.992919 5.060334
C  14.181332 5.731094 4.380878
C  13.610229 6.371644 3.231744
C  14.147566 4.222895 4.609589
C  12.830948 5.504827 2.237965
C  13.352157 4.065719 2.218271
H  12.859048 5.949823 1.236469
H  11.77152 5.444592 2.511063
C  13.251164 3.469311 3.619938
H  14.402708 4.039846 1.87856
H  12.76726 3.46719 1.499423
H  13.538925 2.403963 3.619647
H  12.201893 3.509634 3.950769
H  15.183619 3.89493 4.394873
C  14.403941 7.5449 2.735173
O  15.36015 7.997606 3.356239
C  14.052477 8.239685 1.430681
C  13.515748 9.54054 1.502234
C  13.30825 10.257773 0.312633
C  13.590413 9.651984 -0.931915
C  14.139475 8.359064 -0.992029
C  14.416597 7.66439 0.204768
C  13.252268 10.137226 2.866571
C  12.82534 11.691151 0.315719
C  13.313995 10.441544 -2.192798
C  14.456129 7.726184 -2.333041
C  15.163217 6.345223 0.168581
H  12.96153 9.346381 3.574419
H  12.451102 10.884229 2.852357
H  14.161411 10.615387 3.267046
H  14.576644 5.545036 -0.310111
H  15.431489 6.0021 1.176136
H  16.100994 6.447978 -0.399703
H  13.578227 7.746078 -2.997304
H  14.763749 6.678891 -2.232616
H  15.267647 8.262084 -2.853312
H  12.241133 10.68436 -2.274562
H  13.606101 9.905297 -3.102519
H  13.853513 11.402319 -2.183636
H  12.553012 12.044564 1.315995
H  11.947294 11.820245 -0.334546
H  13.610264 12.362276 -0.072727
P  10.540318 7.274648 3.976644
H  13.842373 6.961672 6.134108
N  11.654411 7.684801 6.856523
H  12.37681 7.645931 7.572765
H  10.95752 6.991438 7.134235
C  11.012493 9.017668 6.926271
H  10.772953 9.22055 7.983607
C  11.95296 10.10653 6.422571
H  12.904436 10.084535 6.976322
H  12.167171 9.95966 5.355753
H  11.48845 11.094177 6.562483
C  9.708304 8.994738 6.183449
C  8.545841 9.723445 6.57404
H  8.463211 10.348088 7.463902
Fe 8.16016 7.717505 6.531063
C  8.634692 5.873168 7.299779
H  9.555423 5.317129 7.126389
C  8.398068 6.807164 8.353778
H  9.115276 7.107796 9.118507
C  7.067421 7.303877 8.208528
H  6.593217 8.058295 8.836588
C  8.019706 8.534764 4.671925
C  9.390763 8.256975 4.992621
H  7.466371 8.115595 3.833225
C  7.506758 9.441788 5.639197
H  6.483574 9.814376 5.687262
H  7.327643 5.191829 5.602482
C  7.453052 5.794654 6.500657
C  6.483916 6.674743 7.067064
H  5.486602 6.86823 6.671455
H  10.032301 10.074858 3.319007
C  10.319723 8.150779 2.367882
C  10.091654 9.534487 2.371084
C  9.929151 10.234247 1.17549
H  9.75233 11.313076 1.200851
C  9.999107 9.56308 -0.046264
H  9.878012 10.112428 -0.984562
C  10.227757 8.186547 -0.062525
H  10.282076 7.648362 -1.013394
C  10.384753 7.486135 1.134953
H  10.536561 6.407177 1.097895
H  8.156456 6.476812 2.28843
C  8.464334 5.624912 2.899251
C  9.579838 5.724907 3.742192
H  10.83406 4.709887 5.155567
C  9.958105 4.615551 4.506902
C  9.237835 3.42175 4.436214
H  9.54744 2.562348 5.038022
C  8.126305 3.328564 3.59509
C  7.740545 4.432645 2.828225
H  6.87132 4.36474 2.167593
H  7.559679 2.394738 3.534499
H  15.139685 6.158145 4.682174
C  13.84847 3.842026 6.059849
H  13.930458 2.751562 6.204191
H  14.547084 4.336024 6.753822
H  12.828955 4.157655 6.333734
elementType: Ir C H O P N Fe
totalener: -3510.28187993 hartree
nucrepener: 8256.45658505 hartree
twoeener: 9531.30603965 hartree
cpcmener: -0.04095285 hartree
kineticenergy: 3429.51350038 hartree
exchangeener: -235.276916374711 hartree
correlationener: -16.491831901620 hartree
xcener: -251.768748276331 hartree
chargesum: -0.0000000
charge: 0.906255 -0.108507 -0.183045 0.092736 0.180979 -0.045836 -0.045978 -0.135893 -0.067692 0.005352 0.021189 0.007217 0.005865 -0.027923 -0.046671 -0.421244 0.204256 -0.000171 0.033930 0.030788 -0.065510 -0.015462 -0.010985 -0.101044 -0.097937 -0.124289 -0.105043 -0.010202 -0.003123 0.024170 0.033878 0.019798 0.044371 0.036002 0.029018 0.052997 0.034556 0.025850 0.045981 0.033668 0.019014 0.046769 -0.614152 -0.146117 -0.269157 0.116158 0.159041 0.079956 0.010787 -0.118612 0.058000 -0.001865 0.047931 -0.192673 -0.280529 0.084985 2.146697 -0.291651 0.037644 -0.321343 0.073597 -0.245933 0.070930 -0.358480 -0.127400 0.083776 -0.191093 0.086666 0.024463 -0.282658 -0.285458 0.083608 0.045791 0.349124 -0.099975 -0.177921 0.113052 -0.146110 0.097526 -0.157233 0.107374 -0.057744 0.039657 0.061803 -0.037903 0.291053 0.004590 0.037082 -0.138856 0.100228 -0.129596 -0.178519 0.100971 0.096331 -0.021444 -0.135541 0.030630 0.034502 0.015920
charge: 0.153876 -0.081657 -0.237476 -0.070059 0.098918 0.103345 -0.040048 -0.048101 0.109206 -0.038096 -0.042979 -0.041119 -0.038972 -0.023945 -0.468910 0.317739 -0.070856 -0.069185 -0.073175 -0.073444 -0.080035 -0.085480 0.235415 0.235144 0.236936 0.230951 0.233249 -0.058844 -0.057039 -0.046922 -0.043335 -0.042085 -0.043173 -0.047346 -0.052386 -0.045083 -0.045991 -0.054050 -0.044643 -0.055537 -0.046995 -0.045839 0.657238 -0.211176 0.655683 -0.130893 -0.128629 -0.123252 -0.008786 0.251799 -0.044729 -0.051594 -0.042692 -0.109257 0.113193 -0.023375 -0.450211 0.072221 -0.035707 0.081855 -0.032281 0.086455 -0.032788 0.081219 -0.169486 -0.026564 0.099614 -0.028993 -0.031492 0.084521 0.086958 -0.031914 -0.037001 -0.163965 0.056416 0.063123 -0.048083 0.064288 -0.048905 0.065129 -0.048971 0.052804 -0.047684 -0.041310 0.060103 -0.169525 -0.051172 0.046593 0.065204 -0.047261 0.064624 0.064143 -0.048392 -0.047936 -0.059781 0.221447 -0.055389 -0.052379 -0.055026
qa: 0.9063 -0.1085 -0.1830 0.0927 0.1810 -0.0458 -0.0460 -0.1359 -0.0677 0.0054 0.0212 0.0072 0.0059 -0.0279 -0.0467 -0.4212 0.2043 -0.0002 0.0339 0.0308 -0.0655 -0.0155 -0.0110 -0.1010 -0.0979 -0.1243 -0.1050 -0.0102 -0.0031 0.0242 0.0339 0.0198 0.0444 0.0360 0.0290 0.0530 0.0346 0.0259 0.0460 0.0337 0.0190 0.0468 -0.6142 -0.1461 -0.2692 0.1162 0.1590 0.0800 0.0108 -0.1186 0.0580 -0.0019 0.0479 -0.1927 -0.2805 0.0850 2.1467 -0.2917 0.0376 -0.3213 0.0736 -0.2459 0.0709 -0.3585 -0.1274 0.0838 -0.1911 0.0867 0.0245 -0.2827 -0.2855 0.0836 0.0458 0.3491 -0.1000 -0.1779 0.1131 -0.1461 0.0975 -0.1572 0.1074 -0.0577 0.0397 0.0618 -0.0379 0.2911 0.0046 0.0371 -0.1389 0.1002 -0.1296 -0.1785 0.1010 0.0963 -0.0214 -0.1355 0.0306 0.0345 0.0159
va: 2.8134 3.7024 3.3468 3.7284 3.6314 3.7961 0.9923 1.0851 3.8199 1.0038 1.0012 1.0095 0.9947 0.9926 3.9034 2.0190 2.7664 3.1934 3.2869 3.3750 3.4256 3.2019 3.8061 3.8655 3.8627 3.8905 3.8452 1.0210 0.9871 1.0222 1.0017 1.0072 0.9920 0.9957 1.0070 0.9993 1.0066 1.0093 0.9985 1.0053 0.9942 1.0004 3.3768 1.0663 3.1323 1.0174 1.0045 3.8644 1.0064 3.8863 0.9968 1.0195 1.0028 3.3589 3.8138 1.0044 2.0097 3.7796 1.0499 3.8472 1.0255 3.8605 1.0176 3.7974 3.4726 1.0204 3.7697 1.0100 1.0869 3.8061 3.8552 1.0167 1.0325 3.1883 3.4855 3.7354 0.9664 3.7772 0.9817 3.7483 0.9667 3.5220 1.0164 0.9979 3.6196 3.3114 1.0689 3.5184 3.7740 0.9771 3.7750 3.7677 0.9810 0.9840 1.0083 3.8973 1.0058 0.9968 1.0047
dispcorr: -0.339937917 hartree
energy: -3510.621817846998
dipole: -160.95460 156.44392 -4.51068 49.95939 -49.59102 0.36837 -216.78746 217.49920 0.71174
magnitude: 4.58132 au
magnitude: 11.64479 debye
