program: Orca
programVersion: 5.0.3
elementType: Ir C C C C C H H C H H H H C O C C C C C C C C C C C H H H H H H H H H H H H H H H P H N H H C H C H H H C C H Fe C H C H C H C C H C H H C C H H C C C H C H C H C H H C C H C C H C C H H H H C H H H
elementType: Ir
charge: 0
multiplicity: 1
keywords: wB97X-D3BJ def2-QZVP def2/J SP VeryTightSCF defgrid3
formula: C43H51IrFeNOP
InChI: InChI=1/C19H19NP.C19H27O.C5H5.Fe.Ir/c1-15(20)18-13-8-14-19(18)21(16-9-4-2-5-10-16)17-11-6-3-7-12-17;1-11-8-7-9-17(10-11)19(20)18-15(5)13(3)12(2)14(4)16(18)6;1-2-4-5-3-1;;/h2-15H,20H2,1H3;11H,7-10H2,1-6H3;1-5H;;/rC43H51FeIrNOP/c1-21-15-14-20-40(39(47)30-25(5)23(3)22(2)24(4)26(30)6)43(21)45(40,49-43)46-27(7)41-37-36-38-42(41,44(36,37,38,41)31-32(44)34(44)35(44)33(31)44)48(45,28-16-10-8-11-17-28)29-18-12-9-13-19-29/h8-13,16-19,21,27,31-38,43H,14-15,20,46H2,1-7H3
99 atoms
Ir 12.373658 7.082906 4.77237
C  14.235815 5.670201 4.483773
C  13.560999 6.233658 3.253058
C  14.030652 4.171088 4.690173
C  12.926426 5.191297 2.329172
C  13.715341 3.868283 2.169994
H  12.731818 5.636617 1.343062
H  11.940664 4.933741 2.734149
C  14.530366 3.476645 3.418976
H  14.388402 3.910595 1.302059
H  12.985693 3.072158 1.944933
H  15.590645 3.758884 3.284756
H  14.517559 2.382688 3.557061
C  14.271807 7.429853 2.74799
O  15.181189 7.958088 3.402426
C  13.889027 8.130824 1.452003
C  13.371318 9.443815 1.528339
C  13.149746 10.16402 0.34362
C  13.376395 9.551823 -0.908188
C  13.908828 8.254211 -0.978775
C  14.224977 7.565002 0.212492
C  13.120739 10.064234 2.883196
C  12.70362 11.609983 0.357318
C  13.06961 10.342892 -2.160868
C  14.181478 7.61146 -2.325228
C  15.014042 6.274122 0.142954
H  12.879829 9.278025 3.616718
H  12.279362 10.767142 2.863838
H  14.012455 10.60168 3.246073
H  14.440957 5.452314 -0.313229
H  15.338386 5.945007 1.137828
H  15.920919 6.414817 -0.466356
H  13.30051 7.678584 -2.981716
H  14.434086 6.548813 -2.231011
H  15.015895 8.105144 -2.851924
H  12.003272 10.622323 -2.194958
H  13.301774 9.792652 -3.07954
H  13.641324 11.28484 -2.183154
H  12.506089 11.983227 1.367875
H  11.788554 11.754061 -0.236083
H  13.478732 12.255171 -0.090112
P  10.384593 7.498495 3.977085
H  13.895531 6.218504 5.474813
N  11.748287 7.700797 6.758807
H  12.584638 7.692528 7.344889
H  11.146883 6.971603 7.144312
C  11.068035 8.999836 6.965341
H  10.924831 9.142745 8.050586
C  11.921297 10.146485 6.434114
H  12.924516 10.128551 6.889531
H  12.029381 10.060629 5.345226
H  11.446252 11.109289 6.6754
C  9.694766 8.991732 6.349722
C  8.560287 9.638638 6.926819
H  8.550819 10.157657 7.885778
Fe 8.211389 7.641313 6.687574
C  8.813996 5.741305 7.169567
H  9.729437 5.258439 6.830138
C  8.662148 6.53117 8.349925
H  9.445569 6.76884 9.070777
C  7.309807 6.986818 8.401823
H  6.882986 7.639798 9.163383
C  7.877208 8.660125 4.95511
C  9.276874 8.389695 5.112208
H  7.251826 8.317682 4.13238
C  7.441607 9.434712 6.066505
H  6.421192 9.770541 6.251386
H  7.357019 5.214337 5.541975
C  7.557349 5.709529 6.491107
C  6.628052 6.475801 7.25568
H  5.589407 6.672998 6.989313
H  9.480861 10.273458 3.322602
C  10.141124 8.426806 2.408655
C  9.695139 9.752666 2.38562
C  9.509809 10.414679 1.168283
H  9.158773 11.450925 1.162738
C  9.768798 9.756793 -0.035004
H  9.619537 10.274597 -0.987168
C  10.234361 8.439362 -0.019015
H  10.457756 7.923862 -0.957351
C  10.422772 7.78236 1.195507
H  10.782917 6.750671 1.202938
H  7.909286 6.925121 2.378118
C  8.248635 5.991307 2.833859
C  9.418988 5.969536 3.605628
H  10.775529 4.751547 4.732272
C  9.850697 4.752858 4.14646
C  9.121029 3.579744 3.939729
H  9.471143 2.636817 4.370067
C  7.946774 3.613302 3.183566
C  7.512972 4.821907 2.629224
H  6.599123 4.852912 2.028554
H  7.371767 2.69709 3.019286
H  15.307188 5.925818 4.519035
H  12.949917 3.976664 4.796536
C  14.742757 3.672016 5.944997
H  14.384017 4.202722 6.842679
H  14.574862 2.593573 6.097056
H  15.830648 3.838614 5.866618
elementType: Ir C H O P N Fe
totalener: -3510.28289627 hartree
nucrepener: 8225.26075041 hartree
twoeener: 9501.30833448 hartree
cpcmener: -0.03652855 hartree
kineticenergy: 3429.56903417 hartree
exchangeener: -235.310335735150 hartree
correlationener: -16.493381602044 hartree
xcener: -251.803717337195 hartree
chargesum: 0.0000000
charge: 0.588828 -0.052008 -0.050703 0.035130 0.185042 -0.043633 -0.033845 -0.127343 -0.020909 -0.008423 0.000320 -0.001441 0.016998 -0.083715 -0.465981 0.164304 -0.015319 0.019169 0.031894 -0.060539 -0.017981 -0.009272 -0.089110 -0.096022 -0.122710 -0.060064 0.009339 0.003318 0.017665 0.022468 0.006542 0.036348 0.032400 0.030956 0.053185 0.031899 0.027289 0.045570 0.028052 0.017712 0.042432 -0.543511 -0.020177 -0.292589 0.119029 0.151174 0.102937 0.004597 -0.128918 0.053933 0.014286 0.042416 -0.162136 -0.299579 0.085685 2.216208 -0.287262 0.039266 -0.315303 0.069321 -0.250290 0.072243 -0.356688 -0.183217 0.077867 -0.209092 0.083495 0.030157 -0.288596 -0.285637 0.081525 0.061843 0.341725 -0.108033 -0.174870 0.106508 -0.158665 0.095102 -0.176394 0.099392 -0.048152 0.069085 0.062778 -0.066873 0.371439 0.046924 0.009315 -0.163131 0.104283 -0.132977 -0.180175 0.101028 0.093701 -0.005832 0.000601 -0.154738 0.031185 0.033400 0.032548
charge: 0.093308 0.042499 -0.257221 -0.068952 0.094056 0.114574 -0.038236 -0.046927 0.113511 -0.056151 -0.046326 -0.033904 -0.041553 -0.500150 0.279646 -0.063757 -0.067853 -0.074070 -0.076162 -0.081402 -0.084634 0.231771 0.235715 0.236843 0.229533 0.231984 -0.075945 -0.057929 -0.051036 -0.045848 -0.040557 -0.043189 -0.048726 -0.052484 -0.045485 -0.045966 -0.054580 -0.045148 -0.056136 -0.048950 -0.047064 0.518865 -0.040218 0.649044 -0.126658 -0.131360 -0.125322 -0.011954 0.250326 -0.046186 -0.050551 -0.044129 -0.103665 0.109522 -0.024830 -0.450375 0.072073 -0.035941 0.078850 -0.033151 0.084853 -0.033555 0.078841 -0.157403 -0.029072 0.095937 -0.030474 -0.031230 0.083590 0.085343 -0.032754 -0.041951 -0.160923 0.054208 0.059150 -0.050934 0.059611 -0.051035 0.066546 -0.048273 0.060115 -0.041885 -0.040478 0.058849 -0.149352 -0.055193 0.045364 0.061046 -0.049541 0.059737 0.060100 -0.049740 -0.049440 -0.022944 -0.024142 0.229662 -0.051841 -0.053457 -0.048775
qa: 0.5888 -0.0520 -0.0507 0.0351 0.1850 -0.0436 -0.0338 -0.1273 -0.0209 -0.0084 0.0003 -0.0014 0.0170 -0.0837 -0.4660 0.1643 -0.0153 0.0192 0.0319 -0.0605 -0.0180 -0.0093 -0.0891 -0.0960 -0.1227 -0.0601 0.0093 0.0033 0.0177 0.0225 0.0065 0.0363 0.0324 0.0310 0.0532 0.0319 0.0273 0.0456 0.0281 0.0177 0.0424 -0.5435 -0.0202 -0.2926 0.1190 0.1512 0.1029 0.0046 -0.1289 0.0539 0.0143 0.0424 -0.1621 -0.2996 0.0857 2.2162 -0.2873 0.0393 -0.3153 0.0693 -0.2503 0.0722 -0.3567 -0.1832 0.0779 -0.2091 0.0835 0.0302 -0.2886 -0.2856 0.0815 0.0618 0.3417 -0.1080 -0.1749 0.1065 -0.1587 0.0951 -0.1764 0.0994 -0.0482 0.0691 0.0628 -0.0669 0.3714 0.0469 0.0093 -0.1631 0.1043 -0.1330 -0.1802 0.1010 0.0937 -0.0058 0.0006 -0.1547 0.0312 0.0334 0.0325
va: 2.8698 3.7981 3.2614 3.7450 3.6783 3.8389 0.9981 1.0838 3.7970 1.0015 1.0052 1.0019 0.9968 3.8919 1.9761 2.7837 3.2119 3.3042 3.3780 3.4137 3.1871 3.7969 3.8671 3.8591 3.8861 3.8258 1.0048 0.9776 1.0186 1.0019 1.0084 0.9875 0.9960 1.0058 1.0004 1.0072 1.0097 0.9984 1.0080 0.9989 0.9973 4.0569 1.0622 3.1858 1.0157 1.0143 3.8859 1.0069 3.8921 0.9963 1.0135 1.0055 3.3542 3.8111 1.0056 1.8280 3.7801 1.0467 3.8353 1.0283 3.8587 1.0155 3.8121 3.5013 1.0223 3.7790 1.0120 1.0764 3.8054 3.8515 1.0168 1.0215 3.2618 3.5126 3.7198 0.9767 3.7766 0.9805 3.7349 0.9719 3.5147 0.9878 1.0000 3.6199 3.1853 1.0340 3.5578 3.7760 0.9774 3.7740 3.7678 0.9797 0.9858 1.0155 0.9774 3.8943 1.0024 1.0052 1.0052
dispcorr: -0.339108289 hartree
energy: -3510.622004560541
dipole: -127.56291 124.45271 -3.11020 36.62570 -36.82163 -0.19593 -181.14088 182.97312 1.83224
magnitude: 3.61508 au
magnitude: 9.18881 debye
