program: Orca
programVersion: 5.0.3
elementType: Ir C C C C C H H C H H H H C O C C C C C C C C C C C H H H H H H H H H H H H H H H P H N H H C H C H H H C C H Fe C H C H C H C C H C H H C C H H C C C H C H C H C H H C C H C C H C C H H H H C H H H
elementType: Ir
charge: 0
multiplicity: 1
keywords: wB97X-D3BJ def2-QZVP def2/J SP VeryTightSCF defgrid3
formula: C43H51IrFeNOP
InChI: InChI=1/C19H19NP.C19H27O.C5H5.Fe.Ir/c1-15(20)18-13-8-14-19(18)21(16-9-4-2-5-10-16)17-11-6-3-7-12-17;1-11-8-7-9-17(10-11)19(20)18-15(5)13(3)12(2)14(4)16(18)6;1-2-4-5-3-1;;/h2-15H,20H2,1H3;11H,7-10H2,1-6H3;1-5H;;/rC43H51FeIrNOP/c1-22-15-14-20-41(21-22,40(47)31-26(5)24(3)23(2)25(4)27(31)6)45-46-28(7)42-38-37-39-43(42,44(37,38,39,42)32-33(44)35(44)36(44)34(32)44)48(45,29-16-10-8-11-17-29)30-18-12-9-13-19-30/h8-13,16-19,22,28,32-39H,14-15,20-21,46H2,1-7H3
99 atoms
Ir 12.217167 7.305854 4.684219
C  13.93944 5.562059 4.400377
C  13.30346 6.250068 3.201449
C  13.647316 4.066609 4.489316
C  12.63577 5.36087 2.152406
C  13.211303 3.92845 1.985281
H  12.64338 5.880157 1.182749
H  11.578174 5.25626 2.418745
C  14.081166 3.448593 3.157011
H  13.786216 3.841939 1.051088
H  12.357823 3.238018 1.876428
H  15.138627 3.724756 2.989388
H  14.053787 2.347588 3.217253
C  14.02106 7.482626 2.861483
O  14.738957 8.037701 3.723983
C  13.950409 8.128652 1.490212
C  13.396886 9.414664 1.337627
C  13.407679 10.023298 0.068561
C  13.923156 9.32795 -1.042029
C  14.546501 8.077317 -0.869763
C  14.58363 7.485412 0.408092
C  12.816777 10.139357 2.528738
C  12.878543 11.428679 -0.124886
C  13.843563 9.95687 -2.417374
C  15.189746 7.397042 -2.061829
C  15.36191 6.201581 0.618757
H  12.556437 9.425976 3.324581
H  11.902833 10.684997 2.259344
H  13.538978 10.864104 2.941803
H  14.975544 5.378891 -0.000976
H  15.340655 5.871694 1.663956
H  16.418912 6.346884 0.343129
H  14.428349 7.059757 -2.785527
H  15.77836 6.518579 -1.774194
H  15.860903 8.084456 -2.600317
H  12.912785 10.528146 -2.542664
H  13.87965 9.203858 -3.214988
H  14.680026 10.657726 -2.587802
H  12.794661 11.970769 0.824582
H  11.87843 11.421731 -0.590056
H  13.539689 12.012406 -0.782946
P  10.175469 7.568343 4.041339
H  13.619086 6.051553 5.394897
N  11.812677 8.14545 6.636307
H  12.726393 8.368683 7.037496
H  11.438021 7.398456 7.222081
C  10.941188 9.330432 6.814262
H  10.944508 9.600661 7.884471
C  11.467264 10.513682 6.008291
H  12.517951 10.725206 6.264445
H  11.40686 10.294523 4.933629
H  10.867331 11.40995 6.226067
C  9.520141 9.001624 6.448216
C  8.370208 9.430258 7.177697
H  8.388792 9.983541 8.11713
Fe 8.414659 7.391651 7.015051
C  9.420646 5.636936 7.327532
H  10.323337 5.340334 6.793588
C  9.370419 6.401043 8.534024
H  10.225929 6.774111 9.098979
C  7.997394 6.616902 8.862817
H  7.624865 7.191933 9.71076
C  7.634554 8.245149 5.340982
C  9.067614 8.269243 5.298319
H  6.986003 7.736693 4.629478
C  7.208596 8.963142 6.494504
H  6.177094 9.090721 6.823153
H  7.780326 4.84565 6.010512
C  8.07815 5.377875 6.91291
C  7.20056 5.980709 7.863677
H  6.111562 5.989821 7.812996
H  8.799254 10.213343 3.704672
C  9.814372 8.653497 2.599649
C  9.159313 9.884095 2.72676
C  8.962772 10.699926 1.607811
H  8.449812 11.659929 1.719418
C  9.414717 10.289212 0.352214
H  9.258319 10.926124 -0.52343
C  10.07381 9.062721 0.21957
H  10.446491 8.742175 -0.757592
C  10.274104 8.253893 1.336744
H  10.805071 7.304173 1.23114
H  7.723527 7.027602 2.390923
C  8.096522 6.074893 2.777387
C  9.262907 6.041488 3.553457
H  10.661784 4.800528 4.59554
C  9.737777 4.807552 4.011299
C  9.056627 3.624883 3.718071
H  9.442344 2.667936 4.082164
C  7.884237 3.668043 2.958091
C  7.406563 4.894738 2.486947
H  6.494516 4.932482 1.883857
H  7.345923 2.744455 2.724918
H  15.030466 5.733124 4.418586
H  12.559253 3.922431 4.602646
C  14.349741 3.428517 5.685592
H  14.038707 3.90514 6.630104
H  14.121112 2.352712 5.755041
H  15.444189 3.537383 5.596804
elementType: Ir C H O P N Fe
totalener: -3510.28458878 hartree
nucrepener: 8192.67879270 hartree
twoeener: 9468.87563750 hartree
cpcmener: -0.03501214 hartree
kineticenergy: 3429.56150577 hartree
exchangeener: -235.312540511216 hartree
correlationener: -16.492119596693 hartree
xcener: -251.804660107909 hartree
chargesum: 0.0000000
charge: 0.635401 -0.015305 -0.135745 0.051905 0.189584 -0.068483 -0.045754 -0.078642 -0.047412 0.004653 0.006714 0.001650 0.018981 -0.037706 -0.480231 0.160142 -0.023706 -0.019262 0.001219 -0.052153 0.019943 -0.029838 -0.107661 -0.122903 -0.110317 -0.102406 0.008162 0.019095 0.028378 0.042914 0.016390 0.034422 0.046253 0.023600 0.044789 0.033129 0.026323 0.051917 0.025988 0.042388 0.036843 -0.624996 0.012106 -0.290208 0.131099 0.146736 0.092463 0.010628 -0.103621 0.053386 0.007084 0.037964 -0.143395 -0.293488 0.083218 2.188084 -0.283866 0.024105 -0.304244 0.062931 -0.265020 0.070391 -0.354346 -0.103497 0.068510 -0.208077 0.083169 0.042291 -0.292092 -0.278834 0.079471 0.057670 0.292865 -0.096864 -0.169379 0.098314 -0.144461 0.092576 -0.156561 0.096253 -0.050613 0.098867 0.063929 -0.085729 0.285845 0.065802 0.061775 -0.166427 0.103866 -0.138720 -0.187176 0.108639 0.098865 -0.014375 0.008947 -0.158085 0.029929 0.031029 0.032010
charge: 0.113772 0.059966 -0.244004 -0.067880 0.102758 0.113499 -0.037965 -0.051016 0.106900 -0.053678 -0.045142 -0.034391 -0.040364 -0.522909 0.270975 -0.065723 -0.072239 -0.077313 -0.077721 -0.080464 -0.078917 0.233154 0.233154 0.233167 0.231742 0.240428 -0.073789 -0.047509 -0.049274 -0.045643 -0.041112 -0.044215 -0.045804 -0.053918 -0.045206 -0.047084 -0.050453 -0.043825 -0.050635 -0.047387 -0.047075 0.475395 -0.031127 0.650702 -0.123509 -0.130342 -0.122264 -0.012445 0.249907 -0.045596 -0.048854 -0.043276 -0.106069 0.110695 -0.025841 -0.447889 0.074202 -0.036642 0.075449 -0.034287 0.084898 -0.033838 0.081533 -0.159509 -0.029740 0.096030 -0.030893 -0.032647 0.083075 0.085379 -0.033067 -0.042821 -0.164856 0.049847 0.054123 -0.051370 0.055352 -0.051614 0.064422 -0.047707 0.059598 -0.039665 -0.040943 0.057781 -0.150677 -0.053766 0.046588 0.060231 -0.049694 0.060340 0.060678 -0.050036 -0.049410 -0.021517 -0.025461 0.229165 -0.052256 -0.053761 -0.048858
qa: 0.6354 -0.0153 -0.1357 0.0519 0.1896 -0.0685 -0.0458 -0.0786 -0.0474 0.0047 0.0067 0.0016 0.0190 -0.0377 -0.4802 0.1601 -0.0237 -0.0193 0.0012 -0.0522 0.0199 -0.0298 -0.1077 -0.1229 -0.1103 -0.1024 0.0082 0.0191 0.0284 0.0429 0.0164 0.0344 0.0463 0.0236 0.0448 0.0331 0.0263 0.0519 0.0260 0.0424 0.0368 -0.6250 0.0121 -0.2902 0.1311 0.1467 0.0925 0.0106 -0.1036 0.0534 0.0071 0.0380 -0.1434 -0.2935 0.0832 2.1881 -0.2839 0.0241 -0.3042 0.0629 -0.2650 0.0704 -0.3543 -0.1035 0.0685 -0.2081 0.0832 0.0423 -0.2921 -0.2788 0.0795 0.0577 0.2929 -0.0969 -0.1694 0.0983 -0.1445 0.0926 -0.1566 0.0963 -0.0506 0.0989 0.0639 -0.0857 0.2858 0.0658 0.0618 -0.1664 0.1039 -0.1387 -0.1872 0.1086 0.0989 -0.0144 0.0089 -0.1581 0.0299 0.0310 0.0320
va: 3.0998 3.8023 3.5038 3.6685 3.6664 3.8429 0.9996 1.0451 3.7989 1.0029 1.0003 1.0028 1.0041 3.7877 1.9693 2.7225 3.2318 3.3791 3.3931 3.4590 3.1226 3.8084 3.8663 3.8688 3.8677 3.8357 0.9963 0.9763 1.0053 0.9965 1.0130 0.9914 0.9984 1.0102 0.9967 0.9993 1.0043 1.0033 1.0097 1.0017 0.9936 4.4266 1.0388 3.1801 1.0131 1.0191 3.9028 1.0002 3.8811 0.9950 1.0173 1.0074 3.3703 3.8058 1.0058 1.9227 3.7679 1.0675 3.8186 1.0295 3.8771 1.0165 3.7838 3.4727 1.0399 3.7964 1.0159 1.0653 3.7976 3.8498 1.0160 1.0296 3.3349 3.5959 3.7813 0.9798 3.7605 0.9858 3.6969 0.9761 3.5571 0.9641 1.0119 3.6041 3.2923 1.0047 3.5054 3.7738 0.9793 3.7766 3.7604 0.9741 0.9829 0.9955 0.9872 3.8988 1.0041 1.0057 1.0054
dispcorr: -0.336873556 hartree
energy: -3510.621462337404
dipole: -108.34169 105.82777 -2.51392 6.68779 -6.71410 -0.02630 -167.61398 169.32573 1.71174
magnitude: 3.04147 au
magnitude: 7.73081 debye
