program: Gaussian 09
title: 000050652
version: EM64L-G09RevD.01
frameworkgroup: C1[X(C17H22N5O2)]
method: RPBEPBE
basis: SDD
operation: Freq
keyword: #p
keyword: freq=noraman
keyword: PBEPBE/SDD
title: #p freq=noraman PBEPBE/SDD
converged: YES YES NO NO
title: Mulliken charges:
elementType: O O N N N N N C C C C C C C C C C C C C C C C C H H H H H H H H H H H H H H H H H H H H H H
charge: -0.334848 -0.254238 -0.137328 -0.047723 -0.075477 -0.143957 -0.128810 0.449740 -0.485528 0.381539 0.062309 -0.337429 -0.333660 -0.635310 -0.639143 0.224091 -0.261660 0.311264 -0.222055 -0.163279 -0.149046 -0.585859 -0.607920 -0.610082 0.276895 0.261081 0.259574 0.254779 0.256865 0.239356 0.255307 0.240745 0.256714 0.288451 0.280036 0.310539 0.265530 0.249046 0.280686 0.275215 0.243503 0.280324 0.215305 0.245704 0.212758 0.275994
chargesum: 1.00000
title: Mulliken charges with hydrogens summed into heavy atoms:
elementType: O O N N N N N C C C C C C C C C C C C C C C C C
charge: -0.334848 -0.254238 -0.137328 -0.047723 -0.075477 -0.143957 -0.128810 0.449740 -0.208633 0.381539 0.062309 -0.076348 -0.074086 0.115690 0.113623 0.224091 0.026791 0.311264 0.088484 0.116757 0.116484 0.219088 0.131213 0.124374
polarizability: 6.17846669e+02 2.16408628e+01 2.30109326e+02 -4.65040978e+00 -2.40948188e+01 1.32635599e+02
1716.lowfreq: -8.2880 -4.2563 -0.0005 -0.0003 0.0003 2.6134 9.1612 16.2201 28.2029
frequency: 7.1777 16.0904 28.1365 30.9455 43.2358 50.1031 58.5714 72.8961 88.7928 97.4430 114.4647 133.2146 144.0964 156.0366 158.6820 174.7284 178.2855 200.2634 222.9976 235.9284 248.8306 258.5659 291.9562 307.1756 333.8687 347.1350 387.6063 402.2068 410.4768 426.1735 437.9855 464.9116 478.1947 515.9073 521.8624 545.2647 569.0844 580.1578 616.7835 641.4669 648.9880 659.1594 674.9405 703.7090 728.3300 742.6845 766.0199 791.4237 822.7935 840.1931 876.2537 883.2898 899.1695 911.1953 927.9448 949.8792 976.1908 978.5045 995.5901 1007.7683 1053.3202 1057.7817 1062.7837 1092.0669 1092.8315 1095.4263 1114.6086 1116.7480 1123.7042 1124.0821 1144.4706 1148.4983 1155.6753 1183.3999 1194.0889 1200.2443 1234.7073 1245.7644 1258.9853 1279.8949 1306.2854 1342.7245 1362.4211 1369.5971 1383.3895 1389.9549 1419.9454 1425.4741 1434.5025 1437.3516 1447.6705 1455.8338 1467.7382 1469.4293 1470.5308 1471.9393 1474.6317 1477.4694 1483.3439 1484.5643 1486.2790 1491.5210 1496.2305 1503.6543 1509.2726 1535.0300 1548.1681 1607.1603 1637.5521 1699.2096 2973.2190 2978.2500 2978.6173 2983.6837 3024.5859 3049.3086 3051.1246 3058.8431 3061.8152 3125.1329 3126.7976 3126.8442 3134.8968 3145.3977 3149.4961 3162.4602 3176.1763 3187.3217 3190.9301 3191.3809 3194.7754 3207.8560
redmass: 1.0981 3.2681 4.3877 3.7749 3.6173 3.2380 2.1479 1.5793 2.6048 3.3383 1.1666 4.8263 1.3554 2.7539 1.9057 2.3909 4.0766 2.9569 3.5023 3.4209 4.2314 3.9351 4.5685 4.7278 4.3121 3.8883 3.5149 4.7867 3.8184 3.3252 3.5935 3.3291 4.4003 4.9020 4.4226 5.0662 4.4532 5.5248 6.0497 6.0903 4.7764 9.4060 2.0509 6.3705 4.6522 5.2660 4.1622 1.4452 1.6544 5.5148 1.7348 1.8349 3.6563 1.4581 3.3643 3.2027 1.3260 2.9741 1.4392 4.1842 1.6021 1.3980 1.7421 1.2369 2.7088 1.2276 1.3796 1.3573 2.0314 1.3791 1.3785 1.9359 1.4899 1.3742 1.7955 4.6124 2.7892 5.3125 1.9704 2.7361 1.4196 4.1570 3.2139 3.0567 4.4099 3.7366 1.4894 1.1474 1.1435 1.1751 1.5670 1.3884 1.0582 1.0456 1.3067 1.3596 1.4965 1.0489 1.0598 1.1559 1.1615 1.6561 1.4730 1.8520 2.6257 2.5694 4.5595 5.2488 6.8175 9.3138 1.0371 1.0380 1.0366 1.0383 1.0338 1.1008 1.1014 1.1004 1.1030 1.0986 1.1029 1.0990 1.0967 1.0966 1.1031 1.0890 1.0891 1.0913 1.0947 1.0956 1.0941 1.0999
irintensity: 0.8631 0.3504 3.7202 2.0880 2.6048 4.5485 1.4535 0.3173 2.1509 0.9441 0.1567 2.3982 1.6586 0.4544 0.0914 1.1034 3.7783 2.6870 1.2032 0.3366 0.8245 3.0783 2.3999 2.6822 2.8689 16.4149 3.2731 1.8522 1.2776 3.2600 3.2824 3.9556 2.3722 12.9647 1.8730 4.9054 1.7707 4.2082 8.8143 0.3684 7.6047 7.4425 33.7156 15.8305 7.3347 19.4353 35.7413 38.5812 40.9484 7.9457 35.9345 31.6207 27.9726 0.8667 1.8477 21.0346 1.2346 38.5774 17.4312 85.6592 22.6064 25.8123 12.5098 3.4936 484.0794 2.7237 19.6057 2.5463 6.2321 3.4526 2.5561 15.5471 29.7046 186.8315 52.2360 5.5011 14.5980 59.4457 413.5310 494.6566 76.1919 632.1927 114.8626 94.6850 26.4900 386.8988 26.3935 25.6580 6.2180 17.3104 1.3126 0.8372 9.0015 4.0578 29.5744 13.6761 49.2777 13.1951 7.4706 85.9419 75.6097 5.1346 50.4777 8.3950 12.9792 138.8751 278.9397 135.1260 547.7360 348.0612 24.3132 81.4670 53.2292 102.3730 10.2833 46.6094 2.5626 3.0391 33.8986 1.9327 1.8779 2.7515 29.0949 5.7590 2.7516 0.3368 7.7167 1.8563 4.0916 6.6981 1.2261 9.0779
temp: 298.150 k
press: 1.00000 atm
elementType: 8 8 7 7 7 7 7 6 6 6 6 6 6 6 6 6 6 6 6 6 6 6 6 6 1 1 1 1 1 1 1 1 1 1 1 1 1 1 1 1 1 1 1 1 1 1
symmnumber: 1
zpe: 975725.7 jmol-1
zpe.correction: 0.371634 hartree
zpe.thermalcorrener: 0.396786 hartree
zpe.thermalcorrenthalpy: 0.397730 hartree
zpe.thermalcorrgfe: 0.312127 hartree
zpe.sumelectzpe: -1083.182361 hartree
zpe.sumelectthermal: -1083.157209 hartree
zpe.sumelectthermalent: -1083.156265 hartree
zpe.sumelectthermalfe: -1083.241868 hartree
dipole: -5.5814 -1.0473 -2.9274
dipole: 6.3890
quadrupole: 22.7390 -102.0569 -142.7814
quadrupole: 1.3747 3.8444 -7.7923
quadrupole: 96.7721 -28.0238 -68.7483 1.3747 3.8444 -7.7923
hfenergy: -1083.553995 hartree
pointgroup: C01 [X(C17H22N5O2)]
dipole: -2.1707124 0.2111026 1.2497031 debye
polarizability: 618.7367368|-7.6501204|232.7976394|-11.0264916|-13.6412237|129.0572183 unknown
InChI: InChI=1S/C17H22N5O2/c1-20(2)14-8-9-15(16(11-14)24-17(23)21(3)4)19-18-13-7-6-10-22(5)12-13/h6-12H,1-5H3
charge 1 multiplicity 1
46 atoms
O  0.961217 -1.557102 0.175965
O  -0.022721 -1.224522 -1.950989
N  5.298914 0.520684 0.073602
N  -4.835913 0.292817 0.649835
N  -0.283814 1.300879 0.120317
N  -0.673106 -3.010444 -0.558891
N  -1.184613 0.335155 0.322162
C  3.929793 0.666882 0.058856
C  3.064193 -0.480932 0.096774
C  1.67789 -0.351101 0.086377
C  1.050665 0.956992 0.055738
C  3.316794 1.971731 -0.014033
C  1.935421 2.089855 -0.018834
C  6.179953 1.704772 -0.01895
C  5.912833 -0.821235 0.162058
C  -2.49994 0.833197 0.261727
C  -3.514053 -0.059325 0.693481
C  0.032946 -1.881628 -0.887379
C  -2.906218 2.115257 -0.236555
C  -5.237116 1.525903 0.177158
C  -4.271432 2.444721 -0.270515
C  -5.880978 -0.660037 1.133213
C  -1.525053 -3.626461 -1.592396
C  -0.519416 -3.742044 0.710659
H  3.466719 -1.495708 0.111504
H  3.931101 2.872819 -0.061005
H  1.460057 3.074754 -0.060165
H  6.028766 2.385329 0.839475
H  5.99896 2.266513 -0.953891
H  7.229539 1.378335 -0.015223
H  5.570142 -1.35689 1.066244
H  7.005662 -0.718644 0.220725
H  5.671473 -1.434143 -0.726844
H  -3.25315 -1.050035 1.070669
H  -6.309423 1.727485 0.16761
H  -2.134779 2.8049 -0.587989
H  -4.608239 3.412866 -0.649555
H  -5.413778 -1.621528 1.388114
H  -6.371888 -0.246688 2.028754
H  -6.628264 -0.820548 0.34035
H  -1.150441 -4.634257 -1.853322
H  -1.512115 -2.995658 -2.493386
H  -2.565431 -3.723836 -1.228518
H  0.126692 -4.632247 0.583207
H  -1.512035 -4.085205 1.056621
H  -0.075816 -3.088528 1.472846
