program: Gaussian 16
title: Title Card Required
version: ES64L-G16RevC.01
frameworkgroup: C1[X(C14H19PRh)]
method: RPBE1PBE
basis: def2SVP
operation: Freq
keyword: #N
keyword: Geom=AllCheck
keyword: Guess=TCheck
keyword: SCRF=Check
keyword: GenChk
keyword: RPBE1PBE/def2SVP
keyword: Freq
converged: YES YES NO NO
title: Mulliken charges:
elementType: C C C C H H H H H C H C C C H C H C H C H H H H Rh P C H C H C H H H H
charge: 0.091013 -0.158881 0.164889 -0.178455 0.063030 0.057797 0.068302 0.069993 0.115270 -0.154927 0.084616 -0.157733 -0.179284 0.075885 0.086612 0.091035 0.115074 -0.158954 0.063004 0.164990 0.063031 0.057813 0.070003 0.068284 0.025468 0.022928 0.075415 0.063015 -0.084734 0.067354 -0.084073 0.067260 0.086865 0.087565 0.090530
chargesum: 1.00000
title: Mulliken charges with hydrogens summed into heavy atoms:
elementType: C C C C C C C C C C C Rh P C C C
charge: 0.154043 -0.101084 0.303184 -0.063185 -0.070311 -0.071121 -0.064210 0.138889 0.154066 -0.101140 0.303277 0.025468 0.287888 0.138429 -0.017380 -0.016813
1716.lowfreq: -8.1370 -0.0011 0.0015 0.0015 3.3149 5.4481 13.2356 23.5591 80.0086
frequency: 13.0500 23.5149 80.0079 182.7616 225.6770 258.8019 266.9226 308.3584 329.8946 346.7875 364.3858 386.4895 401.6794 418.9549 464.5497 517.3243 534.0982 588.0833 588.3881 609.4146 623.0910 742.9871 744.2669 759.3345 770.6152 804.5442 845.3897 861.4743 872.2741 873.4931 901.8072 904.0797 909.9870 910.8075 941.8188 952.8316 961.6939 965.2165 972.1984 975.4621 979.6067 990.1923 998.6851 1007.3628 1024.1167 1047.5259 1058.2372 1065.9217 1080.7301 1081.4129 1100.8929 1105.5151 1110.1671 1119.7870 1125.7765 1133.8321 1144.3875 1176.4683 1206.9847 1209.0844 1239.0616 1245.4285 1252.2079 1257.5338 1262.1878 1269.8684 1274.4301 1283.1818 1291.1123 1300.7386 1301.1124 1304.7395 1319.0279 1331.6360 1346.0900 1349.3716 1362.0816 1365.5701 1466.3762 1466.9988 2463.0073 2487.1907 2489.4444 3076.4614 3081.9751 3085.7492 3087.7624 3094.1708 3095.0347 3097.3123 3099.6752 3130.8227 3133.8801 3148.9720 3154.6741 3162.3932 3162.4271 3171.9833 3172.2947
redmass: 5.1429 1.0447 4.2277 7.1711 4.0164 6.7185 4.2759 8.7983 1.1253 2.9982 1.5505 1.7536 2.4896 5.1524 4.3430 3.5076 5.0542 3.6166 3.1422 3.2860 4.0693 3.4169 5.6553 4.3133 4.8701 4.3087 2.3172 2.0576 1.8831 2.6580 2.9079 2.1613 2.8890 2.4958 1.7535 1.4542 1.4350 1.5036 1.9992 1.8135 1.1048 1.3538 1.4421 1.3781 1.5273 1.8407 1.3782 1.2067 1.4543 1.2786 1.1871 1.0272 1.0460 2.0199 1.9373 1.0524 1.5240 3.6934 2.1503 1.8581 1.4672 1.4984 1.4960 1.5872 1.5188 1.4051 1.8442 2.0061 1.7947 1.3350 1.6233 2.4339 1.7832 1.9236 1.6637 1.8813 1.7027 2.6617 1.1188 1.1194 1.0275 1.0433 1.0434 1.0885 1.0882 1.0861 1.0859 1.0648 1.0625 1.0866 1.0857 1.0893 1.0893 1.0907 1.0907 1.1100 1.1101 1.0926 1.0927
irintensity: 1.0870 0.0185 1.1267 0.2524 2.7982 0.0006 1.7189 0.2945 0.1471 0.5183 3.4900 1.9164 0.0237 0.3694 9.0852 0.0683 0.2016 0.1720 3.1788 1.1766 2.0509 1.7160 0.8475 0.0048 7.9232 6.8061 7.9821 5.6394 2.6740 5.0803 0.3656 0.3456 0.8488 28.7862 0.1411 11.6068 8.5192 0.0121 8.0698 0.3369 116.3700 1.3827 4.9595 0.1111 2.4130 6.8816 5.9874 14.3850 30.7192 15.0980 0.2351 6.7518 3.1051 8.0287 0.4159 0.0010 0.5883 0.0486 8.7430 0.0675 15.7672 0.0009 1.8613 1.8251 8.6818 38.1458 0.3332 0.2962 12.8563 0.0767 4.7036 0.7110 1.2851 0.1780 6.6344 0.0029 2.3068 0.1829 1.1061 10.2385 8.6164 0.5803 2.0714 5.1227 10.7880 0.4230 0.0033 1.7126 20.6937 9.1002 4.1349 4.3436 13.1713 0.1999 13.1062 6.1305 1.1130 6.1907 5.6842
temp: 298.150 k
press: 1.00000 atm
elementType: 6 6 6 6 1 1 1 1 1 6 1 6 6 6 1 6 1 6 1 6 1 1 1 1 45 15 6 1 6 1 6 1 1 1 1
symmnumber: 1
zpe: 775498.3 jmol-1
zpe.correction: 0.295372 hartree
zpe.thermalcorrener: 0.308477 hartree
zpe.thermalcorrenthalpy: 0.309421 hartree
zpe.thermalcorrgfe: 0.253770 hartree
zpe.sumelectzpe: -995.058276 hartree
zpe.sumelectthermal: -995.045171 hartree
zpe.sumelectthermalent: -995.044226 hartree
zpe.sumelectthermalfe: -995.099877 hartree
dipole: 3.2873 -0.0020 0.3343
dipole: 3.3042
quadrupole: -82.8895 -100.2031 -104.3605
quadrupole: -0.0223 2.2892 -0.0055
quadrupole: 12.9282 -4.3853 -8.5428 -0.0223 2.2892 -0.0055
hfenergy: -995.3536475 hartree
pointgroup: C01 [X(C14H19P1Rh1)]
dipole: -1.2841087 -0.1246063 0.1596647 debye
polarizability: 199.416021|0.8670302|190.5050507|-6.6050226|-1.8799707|150.1201579 unknown
InChI: InChI=1/14C.P.Rh.19H
charge 1 multiplicity 1
35 atoms
C  1.893118 0.911136 -0.926357
C  2.101892 1.609431 0.430575
C  1.42294 2.955836 0.204289
C  0.425581 1.254773 -1.201131
H  2.547047 1.37206 -1.683495
H  3.147194 1.638441 0.763995
H  1.352336 3.572513 1.112376
H  1.883865 3.550468 -0.597905
H  0.094151 1.324589 -2.252408
C  -0.231814 1.32619 0.868009
H  -1.030211 1.497435 1.603467
C  0.005255 -1.285344 0.949601
C  0.650163 -1.22434 -1.123738
C  1.284282 -0.604598 1.471434
H  -0.75181 -1.553153 1.700011
C  2.030703 -0.606287 -0.879275
H  0.342528 -1.417347 -2.166828
C  2.354117 -1.17071 0.516905
H  1.485619 -0.958172 2.494896
C  1.929623 -2.628567 0.377927
H  2.760788 -0.988066 -1.610401
H  3.385782 -0.990736 0.845465
H  2.494411 -3.178933 -0.388666
H  1.966089 -3.190665 1.322711
Rh -0.921501 -0.094669 -0.435218
P  -3.24906 -0.296945 0.55408
C  1.145784 0.920205 1.423956
H  1.274153 1.366678 2.422569
C  0.069889 2.361712 -0.205878
H  -0.740645 3.044699 -0.4848
C  0.494088 -2.313848 -0.060251
H  -0.178955 -3.147238 -0.29213
H  -3.61061 0.681121 1.516247
H  -3.490094 -1.456542 1.335267
H  -4.443038 -0.301609 -0.211563
