program: Gaussian 16
title: Title Card Required
version: ES64L-G16RevC.01
frameworkgroup: C1[X(C14H19IrP)]
method: RPBE1PBE
basis: def2SVP
operation: Freq
keyword: #N
keyword: Geom=AllCheck
keyword: Guess=TCheck
keyword: SCRF=Check
keyword: GenChk
keyword: RPBE1PBE/def2SVP
keyword: Freq
converged: YES YES YES YES
title: Mulliken charges:
elementType: C C C C H H H H H C H C C C H C H C H C H H H H P C H C H C H H H H Ir
charge: 0.104885 -0.190366 0.182682 -0.241279 0.060304 0.049789 0.063973 0.063973 0.082671 -0.241274 0.082673 -0.269317 -0.269298 0.109787 0.134521 0.109778 0.134519 -0.225958 0.069104 0.239101 0.069104 0.061836 0.069903 0.069903 0.166981 0.104884 0.060304 -0.057337 0.045871 -0.063539 0.064604 0.079291 0.079294 0.084508 0.114124
chargesum: 1.00000
title: Mulliken charges with hydrogens summed into heavy atoms:
elementType: C C C C C C C C C C C P C C C Ir
charge: 0.165189 -0.140577 0.310629 -0.158608 -0.158602 -0.134796 -0.134780 0.178892 0.178882 -0.164122 0.378907 0.410074 0.165188 -0.011465 0.001066 0.114124
1716.lowfreq: -13.2488 -8.5094 -4.4261 -0.0013 -0.0009 -0.0005 98.6475 127.7543 142.8548
frequency: 98.6462 127.7541 142.8540 159.1430 197.2493 230.2051 295.5350 316.7817 348.0900 361.0612 395.4051 427.3823 459.2455 471.9090 539.8754 568.8108 583.8751 588.0911 635.6667 638.0905 662.4733 733.5232 760.3937 765.8822 780.1943 802.9273 831.7387 857.8903 868.9970 885.6056 894.6604 906.8462 914.4840 922.7486 927.4431 945.6384 957.2564 965.9349 982.2467 994.3135 1011.9686 1016.8865 1026.6001 1030.8178 1032.7810 1042.7591 1044.8776 1075.3452 1079.4094 1086.4232 1105.3568 1108.4861 1110.0523 1117.1861 1126.0516 1126.2897 1140.2849 1157.2958 1203.0433 1220.9324 1224.6216 1231.6214 1257.7638 1259.6725 1263.8750 1267.5637 1273.6930 1287.5471 1292.6662 1298.4771 1299.2684 1320.2012 1330.4541 1334.8183 1353.4847 1356.2780 1369.4639 1375.0666 1466.6144 1468.4632 2457.9131 2468.0881 2476.7369 3075.5904 3082.1757 3089.8304 3091.1485 3092.7464 3096.3112 3113.8615 3115.7447 3126.1767 3126.6966 3140.7966 3151.2285 3158.8283 3159.9217 3179.3606 3228.7159
redmass: 3.7017 5.0153 1.0943 6.6430 4.1919 6.4180 3.0049 4.9373 7.1532 2.6999 2.3678 6.3206 3.8006 2.4443 4.6186 2.1501 1.2237 1.5996 3.4268 3.9406 4.1040 4.1062 3.8787 4.3059 3.7442 4.0989 2.4982 2.9163 2.4145 2.7504 2.3203 1.9379 1.5321 2.9710 1.9103 2.3742 1.5795 1.3432 2.0578 1.4844 1.7004 1.4039 1.2845 1.2598 1.4158 1.1320 1.6874 1.3604 1.2910 1.2749 1.0366 1.7697 1.4750 1.1825 1.1899 1.9445 1.3030 2.0516 1.4939 1.5766 1.7754 1.6942 1.7541 2.0124 1.4840 1.6930 1.5120 1.6667 1.4262 1.5099 1.8356 1.8730 1.7423 1.6758 1.8060 2.1246 1.7595 2.7223 1.1285 1.1252 1.0273 1.0437 1.0423 1.0914 1.0930 1.0773 1.0865 1.0714 1.0619 1.0871 1.0895 1.0895 1.0888 1.0913 1.0913 1.1100 1.1096 1.0915 1.0952
irintensity: 2.9881 1.8586 0.4118 1.6506 1.2274 1.2150 0.3135 3.2549 15.1387 0.0308 0.0020 1.3770 0.1483 0.1447 0.0419 0.1195 1.1746 5.5884 0.3836 1.6739 10.2880 0.6658 2.6117 2.8085 0.8951 0.3409 9.1348 3.7660 4.4568 0.3203 3.8272 0.2226 7.2450 2.7887 0.4074 7.1681 0.0110 0.8472 2.3581 0.4998 2.3494 25.4244 127.0214 11.1987 72.5215 0.1060 2.5940 1.2717 0.0048 0.0069 0.3122 0.2233 3.3126 11.4410 0.1217 0.8399 0.3398 0.0296 6.7425 3.9694 0.9913 2.9501 8.3811 2.7068 1.3987 3.3053 0.6193 2.6256 2.0622 32.2081 0.2040 4.9561 0.3641 7.6867 0.0054 0.1031 2.8989 1.4691 4.9638 6.6273 40.8520 2.9398 2.4092 3.8924 26.9523 1.4156 1.9260 12.0832 9.7925 5.8125 2.3390 0.2088 7.0122 19.6444 4.3322 4.3630 3.3541 4.8548 0.0526
temp: 298.150 k
press: 1.00000 atm
elementType: 6 6 6 6 1 1 1 1 1 6 1 6 6 6 1 6 1 6 1 6 1 1 1 1 15 6 1 6 1 6 1 1 1 1 77
symmnumber: 1
zpe: 781001.2 jmol-1
zpe.correction: 0.297468 hartree
zpe.thermalcorrener: 0.309739 hartree
zpe.thermalcorrenthalpy: 0.310683 hartree
zpe.thermalcorrgfe: 0.259061 hartree
zpe.sumelectzpe: -988.888836 hartree
zpe.sumelectthermal: -988.876564 hartree
zpe.sumelectthermalent: -988.875620 hartree
zpe.sumelectthermalfe: -988.927243 hartree
dipole: -1.1866 -0.7873 -0.0001
dipole: 1.4241
quadrupole: -84.1682 -102.2205 -109.9089
quadrupole: -0.0291 0.0002 0.0000
quadrupole: 14.5977 -3.4546 -11.1431 -0.0291 0.0002 0.0000
hfenergy: -989.1863036 hartree
pointgroup: C01 [X(C14H19Ir1P1)]
dipole: -0.5121426 0.2264311 0.0186216 debye
polarizability: 219.2604586|10.8956933|178.8032266|-0.6947522|1.4552428|143.6832672 unknown
InChI: InChI=1/14C.Ir.P.19H
charge 1 multiplicity 1
35 atoms
C  2.61695568 -1.24427429 1.17271059
C  2.94860011 -2.05470006 -0.09719901
C  1.86171534 -3.11478733 -0.12900326
C  1.06642213 -1.16130899 1.09413746
H  2.88315941 -1.83346205 2.064185
H  3.98040247 -2.42558548 -0.13069075
H  1.85758796 -3.71091433 -1.05353443
H  1.88593512 -3.79367375 0.73625367
H  0.53193382 -1.27643137 2.04827394
C  1.03101886 -1.05795871 -1.14095626
H  0.46648102 -1.08534682 -2.08427681
C  2.49465577 1.40616928 -0.75762813
C  2.52081399 1.32980512 0.89376966
C  3.33926199 0.20723794 -1.19426614
H  1.78011501 1.90655634 -1.43367584
C  3.37704477 0.09692945 1.19100075
H  1.82874063 1.76461266 1.63537097
C  4.33645612 0.24164416 -0.01298697
H  3.84587274 0.44497277 -2.14161722
C  4.76442275 1.70112055 0.04772954
H  3.91368969 0.24696698 2.13976123
H  5.14508464 -0.49556266 -0.05988855
H  5.35424326 1.94057989 0.94470359
H  5.32594983 2.02318834 -0.84151199
P  -1.63310949 -0.09424816 0.06606629
C  2.57817698 -1.13104733 -1.27580126
H  2.81522122 -1.63507608 -2.22580018
C  0.71615473 -2.11506716 -0.06463312
H  -0.30504525 -2.52006039 -0.06718594
C  3.36862525 2.28084222 0.09665037
H  3.16447499 3.351599 0.14938416
H  -2.11811997 -0.90810021 1.12332218
H  -2.15257817 -0.80759582 -1.04598875
H  -2.56479552 0.97405171 0.13035824
Ir 0.54430155 0.52348514 0.06009458
