program: Gaussian 16
title: furanM062xTS
version: ES64L-G16RevA.03
method: UM062X
basis: def2SVP
operation: Freq
keyword: #N
keyword: Geom=AllCheck
keyword: Guess=TCheck
keyword: SCRF=Check
keyword: GenChk
keyword: UM062X/def2SVP
keyword: Freq
converged: YES YES YES YES
elementType: C
elementType: O
elementType: H
1716.lowfreq: -347.5439 -3.3200 -0.0001 0.0014 0.0017 7.7941 14.3302 62.9797 113.9890
frequency: -347.5438 62.9505 113.9848 166.3856 204.1651 266.0467 290.4570 415.7792 510.6136 550.2089 571.4327 613.9011 630.0359 721.8416 771.7973 813.6717 894.8980 921.2357 948.7833 970.8819 1040.2992 1083.0797 1190.3132 1219.8121 1275.9883 1323.3922 1328.2877 1455.2685 1476.6174 1517.5895 1580.1947 1913.5708 3297.4763 3309.8088 3318.6219 3791.7091
redmass: 11.8172 10.8150 10.9180 9.8518 6.2596 6.1651 4.9589 8.4713 6.1773 1.8048 2.6171 8.5935 3.4535 3.7792 3.6153 1.5686 5.8163 1.2470 3.4448 1.3714 1.1704 1.6559 2.0592 1.8546 3.1758 8.4885 3.7320 6.9561 3.3766 5.0858 6.2630 11.8735 1.0938 1.1035 1.1080 1.0653
irintensity: 69.3854 2.8511 1.8633 5.9298 3.2002 6.7359 18.1690 6.0590 2.5382 78.7734 40.1734 9.0580 43.1187 105.0389 140.3454 17.0923 19.5033 32.2775 21.1468 10.2616 44.0653 18.2833 288.9216 140.1137 9.3976 286.5308 102.8666 144.6490 141.1743 0.4468 56.8102 597.5759 2.5415 17.5118 4.8442 264.0546
temp: 298.150 k
press: 1.00000 atm
elementType: 6 6 6 8 1 1 8 8 6 1 6 8 8 1
symmnumber: 1
zpe: 242609.3 jmol-1
zpe.correction: 0.092405 hartree
zpe.thermalcorrener: 0.100594 hartree
zpe.thermalcorrenthalpy: 0.101538 hartree
zpe.thermalcorrgfe: 0.058780 hartree
zpe.sumelectzpe: -568.132535 hartree
zpe.sumelectthermal: -568.124346 hartree
zpe.sumelectthermalent: -568.123402 hartree
zpe.sumelectthermalfe: -568.166160 hartree
dipole: 0.5292 4.6843 -0.5300
dipole: 4.7438
quadrupole: -42.8860 -56.2895 -57.4304
quadrupole: 0.8385 -10.5375 1.6172
quadrupole: 9.3160 -4.0875 -5.2285 0.8385 -10.5375 1.6172
hfenergy: -568.2249397 hartree
pointgroup: C01 [X(C5H4O5)]
dipole: 0.2082106 1.8429307 -0.2085087 debye
dipolederiv: -0.214988 0.1486191 -0.2532053 0.2372217 0.0117856 0.5367666 0.041572 0.3274802 0.3677084 -0.2562495 0.315009 -0.4686 -0.0086848 0.1348274 -0.1776459 -0.2131627 0.0087916 -0.0210902 0.0187829 -0.1685634 0.327791 0.012977 0.1481879 -0.2695611 0.2014977 0.1462112 -0.5409493 -0.4819709 -0.2054092 -0.039948 -0.1606348 -0.5836604 -0.3658667 -0.0579003 -0.4151125 -0.5299386 0.156727 0.0175221 0.0235947 0.0172691 0.1657566 -0.0154908 0.0162352 -0.0360821 0.1535817 0.1073627 -0.0330411 -0.0046971 -0.0189384 0.1551844 -0.0131391 -0.0097025 -0.0176385 0.1770344 0.2024507 -1.2481612 1.058134 -0.470602 0.0591367 -0.1972247 0.1811538 0.199655 -0.4139509 -0.6524049 1.0946369 -0.9412412 0.2728168 -0.2909627 -0.1325252 0.0406534 -0.5932069 0.3963214 0.368068 0.0274872 0.2610529 0.0508058 0.0898993 0.6378516 -0.1703633 0.4096037 0.2909582 0.146613 -0.016594 -0.0207993 -0.0057329 0.1367284 -0.0291352 0.0295446 -0.0280832 0.1296258 2.380587 0.1155286 -0.0430317 0.3069246 1.1285153 0.9111638 -0.3561443 0.8507097 1.5328689 -1.1592863 -0.3089877 -0.2883689 -0.3799488 -0.8349616 -0.4951605 -0.1346816 -0.3808474 -0.8967491 -1.1017452 0.3116558 0.462133 0.1943966 -0.6831138 -0.3569042 0.5218418 -0.4409136 -1.0443612 0.4860535 -0.0497021 -0.072814 -0.0478699 0.362677 -0.0331287 -0.0905439 -0.0305672 0.3989406 unknown
polarizability: 100.3930305|1.1114845|81.5429009|-5.4798587|-0.1951891|71.4452414 unknown
InChI: InChI=1/5C.5O.4H
charge 0 multiplicity 1
14 atoms
C  -0.2156628 0.24618261 -0.09504094
C  0.4959001 1.35128075 0.41557102
C  1.78430884 1.19760484 -0.05497923
O  0.5076371 -0.37827313 -1.0320201
H  0.10451671 2.07641354 1.12307175
H  2.66869142 1.7784601 0.19010466
O  0.58323835 -1.00674345 1.30087372
O  1.75690458 -1.16098013 0.87136715
C  1.76893945 0.01412227 -0.82224662
H  2.53467555 -0.441553 -1.44370583
C  -1.6531264 -0.12244188 -0.00558075
O  -2.18666159 -0.90817494 -0.73648046
O  -2.23467089 0.51738629 0.99925276
H  -3.16844139 0.25079005 1.04560198
