program: Gaussian 16
title: furanM062xTS
version: ES64L-G16RevA.03
method: UM062X
basis: def2SVP
operation: Freq
keyword: #N
keyword: Geom=AllCheck
keyword: Guess=TCheck
keyword: SCRF=Check
keyword: GenChk
keyword: UM062X/def2SVP
keyword: Freq
converged: YES YES YES YES
elementType: C
elementType: O
elementType: H
1716.lowfreq: -354.0591 -12.8425 -9.6172 -3.8409 -0.0017 0.0010 0.0030 92.3199 142.8547
frequency: -354.0590 92.3069 142.8501 152.5457 187.0655 220.3524 298.3665 312.3074 325.2255 448.4886 532.4681 585.8166 610.3939 633.4196 750.2853 809.7100 952.0249 960.4447 975.7323 1019.7372 1035.5523 1182.7434 1295.0803 1300.6276 1352.4714 1431.7674 1437.1709 1520.6124 1562.2098 1883.6438 3049.5456 3298.4525 3312.0154
redmass: 13.5137 12.2809 12.0525 9.6810 8.6292 3.0562 4.8264 5.6020 7.1080 8.9155 11.1146 5.4535 9.7900 7.3357 4.7034 1.2698 6.2215 1.3673 4.7775 1.7037 1.1523 1.6745 6.2292 10.1624 2.5124 7.1415 2.3096 5.3025 6.7216 10.3435 1.0913 1.0952 1.1088
irintensity: 78.2802 4.9164 1.6550 6.2455 10.3038 16.7907 33.4221 9.7153 2.7901 14.5998 3.3568 1.3373 14.8516 30.9285 98.9250 43.0367 47.9409 3.5232 25.8891 5.1748 54.8925 42.7056 166.2602 239.2295 109.6375 261.1463 49.0768 58.3405 42.3412 396.9925 56.6460 9.0482 20.5808
temp: 298.150 k
press: 1.00000 atm
elementType: 6 6 6 8 1 1 8 8 6 6 8 1 17
symmnumber: 1
zpe: 201399.9 jmol-1
zpe.correction: 0.076709 hartree
zpe.thermalcorrener: 0.085280 hartree
zpe.thermalcorrenthalpy: 0.086224 hartree
zpe.thermalcorrgfe: 0.042531 hartree
zpe.sumelectzpe: -952.412591 hartree
zpe.sumelectthermal: -952.404020 hartree
zpe.sumelectthermalent: -952.403076 hartree
zpe.sumelectthermalfe: -952.446769 hartree
dipole: 2.4301 -0.5617 -3.4948
dipole: 4.2936
quadrupole: -71.3414 -57.5788 -63.4137
quadrupole: 4.0349 0.6601 -6.2269
quadrupole: -7.2301 6.5325 0.6976 4.0349 0.6601 -6.2269
hfenergy: -952.4892998 hartree
pointgroup: C01 [X(C5H3Cl1O4)]
dipole: 0.9560628 -0.2209857 -1.3749779 debye
dipolederiv: -0.1734145 -0.4279336 -0.2419179 -0.4743864 0.3363873 -0.1126629 0.0875238 -0.262514 -0.3205342 0.1128161 -0.2606515 -0.4040038 -0.0642783 -0.2579997 -0.3123055 -0.1896645 0.005101 0.1020354 -0.5210056 0.372839 0.3633581 0.4364315 -0.2501804 -0.1999632 0.0206812 0.0440447 0.1206558 -0.6248908 0.1109536 0.0446223 0.0231812 -0.889201 0.3198531 0.0213996 0.258642 -0.2271366 0.1393445 0.0294963 -0.0178341 0.002967 0.1674928 0.0086929 -0.0145684 -0.0003258 0.1822301 0.1311864 -0.0299005 0.005918 -0.0162429 0.1666668 0.0108722 -0.004687 0.0041225 0.1836478 -0.3597722 0.5169375 1.575926 0.070236 -0.0897269 0.3148762 0.4807587 0.2586058 0.2494382 -0.3008426 -0.5246855 -1.6265271 -0.0198918 -0.228746 0.0519383 -0.341179 0.0869301 -0.1321013 1.8328138 -0.3101044 0.2697521 -0.8162032 0.9239187 -0.1446025 0.2337227 -0.3813219 -0.1707683 2.0811201 0.358261 0.3048722 0.2273712 0.9854334 -0.1819306 0.0194795 -0.304196 0.3816765 -1.5005986 -0.0698687 -0.2409552 0.3132804 -0.6070047 0.1525916 -0.1609541 0.1127087 -0.4512469 0.0216496 -0.0083238 -0.0113568 -0.0438862 -0.1168714 0.0637757 0.0225198 0.0989608 0.055594 -0.8384062 0.2429806 -0.0218538 0.3614214 -0.1401688 0.0288646 -0.1750324 0.0792421 0.0265096 unknown
polarizability: 131.4212059|-1.3204731|74.1160277|6.2172627|-4.108943|83.0597694 unknown
InChI: InChI=1/5C.Cl.4O.3H
charge 0 multiplicity 1
13 atoms
C  -1.73389838 0.10595945 -0.42623815
C  -1.39873098 1.28681852 -1.12458723
C  -0.02741671 1.39163779 -1.03824632
O  -0.62222098 -0.6083829 -0.16922614
H  -2.1152064 1.99737206 -1.52729032
H  0.62516847 2.20036395 -1.35335454
O  -1.52755093 1.03037065 1.36894379
O  -0.27592477 1.10001852 1.47827316
C  0.38058675 0.26489591 -0.28946151
C  -3.04283566 -0.55233942 -0.21327848
O  -4.07226273 -0.00675903 -0.50443687
H  -2.99138525 -1.55678084 0.25666015
Cl 1.9454117 -0.29291413 0.02133594
