program: Gaussian 09
title: 000050503
version: EM64L-G09RevD.01
frameworkgroup: C1[X(C17H16BrNO2)]
method: RPBEPBE
basis: SDD
operation: Freq
keyword: #p
keyword: freq=noraman
keyword: PBEPBE/SDD
title: #p freq=noraman PBEPBE/SDD
converged: YES YES NO NO
title: Mulliken charges:
elementType: Br O O N C C C C C C C C C C C C C C C C C H H H H H H H H H H H H H H H H
charge: 0.020427 -0.281853 -0.402265 -0.101283 0.362268 0.455058 -0.470130 0.161455 -0.531085 0.167814 -0.620422 0.264872 -0.461547 0.312046 -0.614664 -0.629584 -0.374080 -0.373856 -0.239562 -0.228985 -0.242365 0.155281 0.251142 0.302257 0.268904 0.230566 0.190773 0.228431 0.191117 0.255228 0.228730 0.228655 0.264229 0.344558 0.228556 0.228246 0.231068
chargesum: 0.00000
title: Mulliken charges with hydrogens summed into heavy atoms:
elementType: Br O O N C C C C C C C C C C C C C C C C C
charge: 0.020427 -0.281853 -0.057707 -0.101283 0.362268 0.455058 -0.063707 0.161455 -0.228828 0.167814 -0.620422 0.264872 -0.192643 0.312046 0.035106 0.045491 -0.145426 -0.109627 -0.011006 -0.000739 -0.011297
polarizability: 3.84678641e+02 -1.40912167e+01 2.51777409e+02 7.72333698e+00 6.58055645e+00 1.01826208e+02
1716.lowfreq: -2.4021 -0.0008 -0.0006 -0.0005 4.2579 5.0933 30.5429 35.8601 44.7758
frequency: 30.4830 35.7878 44.7438 60.6121 73.9330 89.1781 105.1434 142.1970 157.8466 160.4246 208.3080 217.6626 231.1922 255.9367 263.7336 279.6594 307.9466 318.4308 338.1638 341.0886 355.2579 389.3202 401.1141 430.5327 475.1405 486.4184 498.8367 522.3971 576.2646 614.1696 617.1602 646.6075 664.8003 682.6957 695.0238 754.7502 760.8560 776.4594 813.7697 832.3705 833.4541 853.1069 881.6069 898.9869 910.1970 928.6880 977.6767 981.7720 987.6636 995.6307 999.6794 1030.3701 1035.1625 1038.4468 1080.9609 1083.7969 1092.1822 1131.4265 1144.5043 1168.5269 1170.2235 1175.7293 1177.0794 1193.6465 1236.5258 1264.9438 1266.4366 1294.1147 1310.8880 1327.1603 1346.9108 1382.0804 1391.6274 1420.8025 1430.9928 1438.8791 1446.7352 1455.0536 1462.4772 1468.2611 1473.5657 1478.5612 1482.1687 1486.0563 1568.2930 1573.7831 1589.0816 1618.1081 1635.2636 2726.8028 2860.7610 2872.6828 2987.4339 3025.6297 3036.4400 3084.5505 3095.0646 3127.9162 3135.9605 3148.7304 3161.9588 3171.7418 3173.3584 3235.3677 3532.7424
redmass: 3.5708 3.8163 4.6301 4.4052 3.5882 5.5098 6.2002 5.7107 4.7161 5.5315 2.2048 2.2195 1.1437 2.9983 4.4496 4.0900 4.0197 1.8728 1.9806 4.1096 2.2659 5.2371 2.8316 2.4888 4.9530 3.9368 8.5000 4.6980 5.3223 5.2860 5.0793 4.1914 5.4714 6.4783 1.8646 4.1660 7.5684 1.8858 5.5574 1.8448 3.6437 1.2616 6.0865 3.1032 1.5943 1.4423 1.8413 1.3812 6.1071 4.7129 1.3232 2.0833 1.8994 1.8064 2.0130 2.1186 1.3421 1.4112 2.3175 1.7957 1.4328 1.1313 1.7378 1.1276 2.3080 2.8403 3.6078 1.6654 8.3960 1.3917 1.9109 6.6134 2.6216 1.1432 2.1256 1.7884 2.0237 1.1273 1.0578 2.9223 1.0981 1.1238 2.5939 1.1000 8.2892 6.8393 6.8803 6.1316 9.1155 1.0703 1.0565 1.0563 1.0829 1.0733 1.0733 1.1012 1.1011 1.0848 1.0882 1.0938 1.0969 1.0927 1.0993 1.0976 1.0654
irintensity: 0.1916 0.3383 1.3046 0.8369 0.4373 0.3709 1.6086 0.1553 0.6223 0.3139 0.7113 1.0918 0.9114 0.8779 0.1049 11.7440 6.1134 51.6738 38.8444 18.0257 6.0288 13.2675 0.1320 2.7189 8.1498 2.4542 1.3324 4.7016 4.2082 1.4357 1.5994 8.0661 2.0612 4.4516 43.8490 4.4646 16.3505 69.7958 28.0588 29.0610 13.8789 1.4818 33.4942 57.6216 31.4192 4.5485 9.5540 0.0809 0.7207 19.5136 0.3383 13.9456 23.3458 44.2564 3.1257 24.6776 5.2431 1.0813 117.1409 8.5523 80.6121 25.8657 129.8025 0.9465 0.2993 20.0971 3.1530 7.5908 15.7484 1.7315 158.7830 5.2091 85.9204 3.9167 12.8969 12.9483 6.5680 9.5228 16.0110 13.5057 15.3732 4.8429 14.5199 10.3608 16.6603 6.6902 0.8224 8.8885 14.9552 136.9539 67.7957 239.1530 22.0468 37.0952 27.1458 26.2858 36.8995 3.8388 2.9924 28.0642 30.2007 2.3395 15.2814 5.5935 68.9886
temp: 298.150 k
press: 1.00000 atm
elementType: 35 8 8 7 6 6 6 6 6 6 6 6 6 6 6 6 6 6 6 6 6 1 1 1 1 1 1 1 1 1 1 1 1 1 1 1 1
symmnumber: 1
zpe: 751570.9 jmol-1
zpe.correction: 0.286258 hartree
zpe.thermalcorrener: 0.305800 hartree
zpe.thermalcorrenthalpy: 0.306744 hartree
zpe.thermalcorrgfe: 0.236558 hartree
zpe.sumelectzpe: -874.542705 hartree
zpe.sumelectthermal: -874.523163 hartree
zpe.sumelectthermalent: -874.522219 hartree
zpe.sumelectthermalfe: -874.592405 hartree
dipole: -1.5244 -3.0912 0.2585
dipole: 3.4563
quadrupole: -98.4630 -129.3897 -136.9563
quadrupole: 13.5674 1.0298 0.1493
quadrupole: 23.1400 -7.7867 -15.3533 13.5674 1.0298 0.1493
hfenergy: -874.828963 hartree
pointgroup: C01 [X(C17H16Br1N1O2)]
dipole: 0.6585748 -1.1788798 -0.1600963 debye
polarizability: 383.0070164|20.1539308|253.7307395|8.4096907|1.0892961|101.5445028 unknown
InChI: InChI=1S/C17H16BrNO2/c1-19(2)10-12-8-15-13(16(18)17(12)20)9-14(21-15)11-6-4-3-5-7-11/h3-9,20H,10H2,1-2H3
charge 0 multiplicity 1
37 atoms
Br 1.131284 4.023356 0.079314
O  -0.910216 -0.790382 0.122415
O  3.69074 2.358704 0.277672
N  4.206011 -1.924904 -0.157655
C  2.734579 0.061882 0.267185
C  0.15786 1.267128 0.114124
C  4.12108 -0.566226 0.408108
C  0.343832 -0.146916 0.16237
C  1.591246 -0.767915 0.239417
C  2.587519 1.490747 0.223225
C  1.308625 2.086612 0.143633
C  -1.888173 0.247686 0.050019
C  -1.267589 1.491934 0.042463
C  -3.285889 -0.175759 0.00178
C  5.357775 -2.686736 0.365435
C  4.144331 -1.937521 -1.634752
C  -4.328751 0.791794 -0.060152
C  -3.628548 -1.557265 0.017495
C  -5.676659 0.386638 -0.105364
C  -4.979841 -1.956384 -0.027762
C  -6.010528 -0.989359 -0.089408
H  4.904745 0.102284 -0.057202
H  4.383028 -0.632232 1.48354
H  1.720359 -1.852613 0.272798
H  -1.759667 2.460173 -0.007815
H  5.305065 -2.73784 1.467446
H  6.347415 -2.247265 0.082439
H  5.322705 -3.718306 -0.026605
H  5.026573 -1.437604 -2.10836
H  3.232064 -1.420589 -1.976382
H  4.104221 -2.980259 -1.994549
H  -4.083625 1.859535 -0.071609
H  -2.829386 -2.302819 0.0658
H  4.539142 1.848997 0.223265
H  -6.468764 1.141971 -0.152383
H  -5.230321 -3.022897 -0.014761
H  -7.059842 -1.30205 -0.124283
