program: TURBOMOLE
programVersion: 7.3
elementType: v
basis: def2-TZVP
elementType: o
elementType: ti
elementType: c
elementType: h
method: uhf
method: dft
functional: pbe0
elementType: v o ti c h
basis: def2-TZVP def2-TZVP def2-TZVP def2-TZVP def2-TZVP
correction: disp3
energy: -7516.912124526 hartree
formula: C13H40O19TiV5
InChI: InChI=1/13CH3O.H2O.5O.Ti.5V/c13*1-2;;;;;;;;;;;;/h13*1H3;1H2;;;;;;;;;;;/q;;;;;;;;;;;;-1;;;;;;;+1;;;;;+1/p-1/rC13H40O19TiV5/c1-19-33-20-38(18,24(33)5)30(11)35(15,22(33)3)25(6)34(14,21(33)2)26(7)36(16,23(33)4,31(38)12)29(10)37(17,27(34)8,28(35)9)32(38)13/h18H,1-13H3
78 atoms
V  -1.90458165 -0.39287124 -1.40590615
O  -3.16281796 -0.55226128 -2.34302007
Ti -0.19013932 2.043127 -0.19726582
V  1.40547274 -0.14052834 -1.97829622
O  2.30751099 -0.13678924 -3.27022181
O  -1.74629771 1.63423126 -1.35249197
O  -0.41303844 -0.42653483 -2.73936902
O  0.90983254 1.82276278 -1.82891828
O  -1.36336896 -2.26185971 -0.98737521
O  1.38927075 -2.0364269 -1.40361875
O  2.74636282 0.16176543 -0.52719339
O  -0.018786 0.09721686 0.02886859
C  -2.94588954 2.35684197 -1.32696618
H  -2.73351142 3.42896425 -1.2502099
H  -3.56168339 2.05116989 -0.47486871
H  -3.50729492 2.15989495 -2.24538391
C  -0.4968687 -1.44055423 -3.71661004
H  0.2459361 -1.24919991 -4.49771603
H  -1.50014411 -1.43880864 -4.15423906
H  -0.30219948 -2.42246324 -3.27614861
C  0.58102727 2.47456213 -3.0306235
H  1.42152334 2.39178536 -3.72588263
H  0.36854135 3.52990911 -2.83011428
H  -0.30277328 2.01357511 -3.48134363
C  -2.30912449 -3.2972362 -0.89548475
H  -2.59451658 -3.48434753 0.14475754
H  -1.87513866 -4.21938483 -1.29722329
H  -3.20440754 -3.0395106 -1.46930282
C  2.64107506 -2.68820164 -1.44432283
H  2.49406472 -3.75851592 -1.2696698
H  3.31365179 -2.2911814 -0.67925993
H  3.09443528 -2.5364149 -2.42903484
C  3.73824173 1.11451676 -0.81513898
H  4.44683064 1.17186554 0.01754039
H  3.3014504 2.10619337 -0.97883121
H  4.26848062 0.82130888 -1.72720612
V  1.96627432 0.18909012 1.32032548
O  3.26792041 0.39170614 2.18875614
V  0.2489933 -2.48371152 0.18764852
O  0.40187244 -4.0476551 0.2525513
V  -1.24378531 -0.06936757 1.76283601
O  -2.29634659 -0.12650495 3.28939251
O  1.78530519 -1.7921125 1.2661298
O  0.5193157 0.17240763 2.70186843
O  -0.98579801 -2.07516258 1.68970793
O  1.44263553 2.10878047 0.91887694
O  -1.31899848 1.96936813 1.41400304
O  -2.74085532 -0.20165582 0.39743894
C  2.19975653 -2.45998563 2.43250114
H  1.93204424 -3.51899731 2.37177147
H  3.2866667 -2.36647997 2.5329211
H  1.73695261 -2.0257924 3.32408449
C  0.57651928 1.13874105 3.71567423
H  -0.18421253 0.91392414 4.47097794
H  1.56902098 1.13241866 4.17962105
H  0.38582175 2.14353565 3.31976969
C  -1.05222009 -2.80983119 2.88071716
H  -2.07036419 -2.76269171 3.28172671
H  -0.78197409 -3.85471938 2.69249184
H  -0.38182405 -2.40300275 3.64559486
C  2.13373096 3.25010282 1.32989258
H  2.35648057 3.89581917 0.47260792
H  1.53695489 3.82848609 2.04701989
H  3.07308349 2.96332503 1.81025079
C  -2.23131732 2.85390478 1.96927152
H  -2.20897423 3.815703 1.44478043
H  -3.25391692 2.45826343 1.90228745
H  -2.00066801 3.03344391 3.02857881
C  -3.87540627 -0.94120653 0.7600693
H  -4.49146823 -1.14172885 -0.12295255
H  -3.60534768 -1.89224985 1.22956782
H  -4.46923644 -0.37345595 1.48659551
O  -0.33292077 3.84208888 -0.33717877
C  -0.27434719 5.20920844 -0.19930562
H  -0.30275068 5.50480613 0.85851236
H  0.65094724 5.61107529 -0.63365585
H  -1.12063436 5.69074186 -0.70804872
H  -2.85431157 0.64007455 3.44196785
empdispcorrection: -0.124693796 hartree
energy: -7516.9121245262158
energyOcCorr: -7516.9149644275
s2: 12.05790932
charge: -1.000000
dipole: -11.159770 10.205168 -0.954603 22.201055 -18.807622 3.393433 15.737942 -14.783247 0.954695
quadrupole: 5050.443241 -5290.011703 -239.568461 5935.809059 -6153.609235 -217.800176 4902.652318 -5146.479932 -243.827614 22.814129 -25.489081 -2.674952 -37.939888 34.325395 -3.614493 -18.873191 21.136641 2.263450
