program: TURBOMOLE
programVersion: 7.3
elementType: v
basis: def2-TZVP
elementType: o
elementType: c
elementType: h
method: uhf
method: dft
functional: pbe0
elementType: v o c h
basis: def2-TZVP def2-TZVP def2-TZVP def2-TZVP
correction: disp3
energy: -7570.900060319 hartree
formula: C12H36O19V6
InChI: InChI=1/12CH3O.7O.6V/c12*1-2;;;;;;;;;;;;;/h12*1H3;;;;;;;;;;;;;/rC12H36O18V6.O/c1-19-31(13)20(2)33(15)22(4)32(19,14)23(5)34(16,21(31)3)28(10)35(17,24(31)6,26(33)8)30(12)36(18,25(32)7,27(33)9)29(34)11;/h1-12H3;
73 atoms
V  0.7635589 -2.09146678 -0.66460454
O  1.2639533 -3.53290551 -1.07838767
V  -0.55830358 0.55487328 -2.05394279
O  -0.97328172 0.95473293 -3.52297941
O  -1.12699326 -2.52087691 -0.19677192
O  0.05749428 -1.33898127 -2.35704787
O  -2.30496439 -0.18939993 -1.37913786
O  2.45696153 -1.05989098 -0.81520588
O  1.37664386 1.11761776 -2.06392589
O  -0.98511031 2.26681241 -1.08290907
O  0.06105267 -0.03999848 0.13707575
C  -1.75242981 -3.57354559 -0.87517305
H  -2.81113809 -3.61575618 -0.59971787
H  -1.266538 -4.51865232 -0.60736326
H  -1.67242664 -3.45451904 -1.96128883
C  0.67066064 -1.59939467 -3.59286248
H  -0.07326687 -1.50315141 -4.39137117
H  1.08227657 -2.61389787 -3.59696588
H  1.47702002 -0.88832805 -3.7981272
C  -3.08170568 -0.87803575 -2.32491688
H  -3.43973174 -0.17025933 -3.08052719
H  -3.93718395 -1.34962247 -1.83044738
H  -2.49815862 -1.64958465 -2.83670238
C  3.44971764 -1.31680868 -1.7686301
H  4.43168215 -1.08147117 -1.34280587
H  3.31655239 -0.69733323 -2.66212745
H  3.42061925 -2.37174417 -2.05992579
C  1.67374554 2.26725091 -2.81385789
H  2.71372863 2.56395579 -2.64320806
H  1.0181739 3.10122288 -2.5446436
H  1.5241793 2.05171949 -3.87747157
C  -2.08158758 2.99722702 -1.56756848
H  -2.30132229 3.82998869 -0.89164215
H  -2.97338983 2.36906747 -1.65835465
H  -1.84280497 3.38724167 -2.56317999
V  -0.66384224 2.0333451 0.85903916
O  -1.10635726 3.41921735 1.47830052
V  2.16121585 0.83411727 -0.2653342
O  3.63691097 1.38234496 -0.41187284
V  0.65579264 -0.61211156 2.24399552
O  1.06758568 -1.0087285 3.70416934
O  1.25150301 2.43849864 0.47853431
O  -0.06723237 1.11152996 2.60043308
O  2.2733601 0.22773081 1.70000583
O  -2.33360008 0.97817482 1.09140037
O  -1.11607106 -1.30380829 2.24039532
O  1.22524851 -2.18625024 1.33995907
C  1.59862197 3.75878552 0.16898413
H  2.65312145 3.8069417 -0.12136635
H  0.98662871 4.15324326 -0.64960474
H  1.43092083 4.39428847 1.04592689
C  -0.86940846 1.30647589 3.74006083
H  -0.34672626 0.92807383 4.62420178
H  -1.07570098 2.37397707 3.84557209
H  -1.81419688 0.7665096 3.62176187
C  2.95566763 1.06997948 2.59719268
H  3.10641948 0.54689758 3.5468333
H  3.91600016 1.34750017 2.15679095
H  2.36525207 1.97459052 2.77439841
C  -3.62128597 1.5208365 1.00178531
H  -4.02780361 1.42235814 -0.0105553
H  -4.29009451 0.98351071 1.68361874
H  -3.59689758 2.58111928 1.2734382
C  -1.37624936 -2.5510553 2.83762738
H  -2.45617913 -2.71446023 2.85300068
H  -0.89948075 -3.34517718 2.25423901
H  -0.97266421 -2.56029399 3.85499198
C  2.44894733 -2.7849945 1.69242293
H  2.5381785 -3.73772043 1.16559864
H  3.27645041 -2.13145756 1.39865225
H  2.48080982 -2.94155524 2.77530341
O  -3.47956703 -1.49985221 0.81307068
V  -2.06311419 -0.89337585 0.45847732
empdispcorrection: -0.119322047 hartree
energy: -7570.9000603193654
energyOcCorr: -7570.9028558810
s2: 8.81714988
charge: -1.000000
dipole: 29.749655 -29.619657 0.129998 -14.647162 14.485321 -0.161841 46.116262 -45.488774 0.627488
quadrupole: 4876.745634 -5108.209398 -231.463765 4889.744269 -5121.057126 -231.312857 4912.603591 -5135.940271 -223.336680 0.484331 -1.099120 -0.614790 14.460098 -11.952258 2.507839 -8.041142 5.666903 -2.374239
